qemu-devel
[Top][All Lists]
Advanced

[Date Prev][Date Next][Thread Prev][Thread Next][Date Index][Thread Index]

Re: [PULL 0/4] s390x/ipl: Fixes for ipl and bios


From: no-reply
Subject: Re: [PULL 0/4] s390x/ipl: Fixes for ipl and bios
Date: Tue, 10 Mar 2020 10:13:32 -0700 (PDT)

Patchew URL: https://patchew.org/QEMU/address@hidden/



Hi,

This series failed the asan build test. Please find the testing commands and
their output below. If you have Docker installed, you can probably reproduce it
locally.

=== TEST SCRIPT BEGIN ===
#!/bin/bash
export ARCH=x86_64
make docker-image-fedora V=1 NETWORK=1
time make docker-test-debug@fedora TARGET_LIST=x86_64-softmmu J=14 NETWORK=1
=== TEST SCRIPT END ===

PASS 1 fdc-test /x86_64/fdc/cmos
PASS 2 fdc-test /x86_64/fdc/no_media_on_start
PASS 3 fdc-test /x86_64/fdc/read_without_media
==6135==WARNING: ASan doesn't fully support makecontext/swapcontext functions 
and may produce false positives in some cases!
PASS 4 fdc-test /x86_64/fdc/media_change
PASS 5 fdc-test /x86_64/fdc/sense_interrupt
PASS 6 fdc-test /x86_64/fdc/relative_seek
---
PASS 32 test-opts-visitor /visitor/opts/range/beyond
PASS 33 test-opts-visitor /visitor/opts/dict/unvisited
MALLOC_PERTURB_=${MALLOC_PERTURB_:-$(( ${RANDOM:-0} % 255 + 1))}  
tests/test-coroutine -m=quick -k --tap < /dev/null | ./scripts/tap-driver.pl 
--test-name="test-coroutine" 
==6186==WARNING: ASan doesn't fully support makecontext/swapcontext functions 
and may produce false positives in some cases!
==6186==WARNING: ASan is ignoring requested __asan_handle_no_return: stack top: 
0x7ffcdfd42000; bottom 0x7fcf09510000; size: 0x002dd6832000 (196872445952)
False positive error reports may follow
For details see https://github.com/google/sanitizers/issues/189
PASS 1 test-coroutine /basic/no-dangling-access
---
PASS 12 fdc-test /x86_64/fdc/read_no_dma_19
PASS 13 fdc-test /x86_64/fdc/fuzz-registers
MALLOC_PERTURB_=${MALLOC_PERTURB_:-$(( ${RANDOM:-0} % 255 + 1))}  
QTEST_QEMU_BINARY=x86_64-softmmu/qemu-system-x86_64 QTEST_QEMU_IMG=qemu-img 
tests/qtest/ide-test -m=quick -k --tap < /dev/null | ./scripts/tap-driver.pl 
--test-name="ide-test" 
==6201==WARNING: ASan doesn't fully support makecontext/swapcontext functions 
and may produce false positives in some cases!
PASS 14 test-aio /aio/timer/schedule
PASS 15 test-aio /aio/coroutine/queue-chaining
==6209==WARNING: ASan doesn't fully support makecontext/swapcontext functions 
and may produce false positives in some cases!
PASS 16 test-aio /aio-gsource/flush
PASS 17 test-aio /aio-gsource/bh/schedule
PASS 18 test-aio /aio-gsource/bh/schedule10
---
PASS 26 test-aio /aio-gsource/event/flush
PASS 27 test-aio /aio-gsource/event/wait/no-flush-cb
PASS 1 ide-test /x86_64/ide/identify
==6215==WARNING: ASan doesn't fully support makecontext/swapcontext functions 
and may produce false positives in some cases!
PASS 2 ide-test /x86_64/ide/flush
==6221==WARNING: ASan doesn't fully support makecontext/swapcontext functions 
and may produce false positives in some cases!
PASS 3 ide-test /x86_64/ide/bmdma/simple_rw
PASS 28 test-aio /aio-gsource/timer/schedule
MALLOC_PERTURB_=${MALLOC_PERTURB_:-$(( ${RANDOM:-0} % 255 + 1))}  
tests/test-aio-multithread -m=quick -k --tap < /dev/null | 
./scripts/tap-driver.pl --test-name="test-aio-multithread" 
==6230==WARNING: ASan doesn't fully support makecontext/swapcontext functions 
and may produce false positives in some cases!
==6227==WARNING: ASan doesn't fully support makecontext/swapcontext functions 
and may produce false positives in some cases!
PASS 1 test-aio-multithread /aio/multi/lifecycle
PASS 4 ide-test /x86_64/ide/bmdma/trim
==6247==WARNING: ASan doesn't fully support makecontext/swapcontext functions 
and may produce false positives in some cases!
PASS 2 test-aio-multithread /aio/multi/schedule
PASS 3 test-aio-multithread /aio/multi/mutex/contended
PASS 4 test-aio-multithread /aio/multi/mutex/handoff
==6268==WARNING: ASan doesn't fully support makecontext/swapcontext functions 
and may produce false positives in some cases!
PASS 5 test-aio-multithread /aio/multi/mutex/mcs
PASS 6 test-aio-multithread /aio/multi/mutex/pthread
MALLOC_PERTURB_=${MALLOC_PERTURB_:-$(( ${RANDOM:-0} % 255 + 1))}  
tests/test-throttle -m=quick -k --tap < /dev/null | ./scripts/tap-driver.pl 
--test-name="test-throttle" 
==6280==WARNING: ASan doesn't fully support makecontext/swapcontext functions 
and may produce false positives in some cases!
PASS 1 test-throttle /throttle/leak_bucket
PASS 2 test-throttle /throttle/compute_wait
PASS 3 test-throttle /throttle/init
---
PASS 14 test-throttle /throttle/config/max
PASS 15 test-throttle /throttle/config/iops_size
MALLOC_PERTURB_=${MALLOC_PERTURB_:-$(( ${RANDOM:-0} % 255 + 1))}  
tests/test-thread-pool -m=quick -k --tap < /dev/null | ./scripts/tap-driver.pl 
--test-name="test-thread-pool" 
==6284==WARNING: ASan doesn't fully support makecontext/swapcontext functions 
and may produce false positives in some cases!
PASS 1 test-thread-pool /thread-pool/submit
PASS 2 test-thread-pool /thread-pool/submit-aio
PASS 3 test-thread-pool /thread-pool/submit-co
---
PASS 2 test-hbitmap /hbitmap/size/0
PASS 3 test-hbitmap /hbitmap/size/unaligned
PASS 4 test-hbitmap /hbitmap/iter/empty
==6351==WARNING: ASan doesn't fully support makecontext/swapcontext functions 
and may produce false positives in some cases!
PASS 5 test-hbitmap /hbitmap/iter/partial
PASS 6 test-hbitmap /hbitmap/iter/granularity
PASS 7 test-hbitmap /hbitmap/iter/iter_and_reset
---
PASS 28 test-hbitmap /hbitmap/truncate/shrink/medium
PASS 29 test-hbitmap /hbitmap/truncate/shrink/large
PASS 30 test-hbitmap /hbitmap/meta/zero
==6361==WARNING: ASan doesn't fully support makecontext/swapcontext functions 
and may produce false positives in some cases!
PASS 31 test-hbitmap /hbitmap/meta/one
PASS 32 test-hbitmap /hbitmap/meta/byte
PASS 33 test-hbitmap /hbitmap/meta/word
---
PASS 41 test-hbitmap /hbitmap/next_zero/next_zero_after_truncate
PASS 42 test-hbitmap /hbitmap/next_dirty_area/next_dirty_area_0
PASS 43 test-hbitmap /hbitmap/next_dirty_area/next_dirty_area_1
==6367==WARNING: ASan doesn't fully support makecontext/swapcontext functions 
and may produce false positives in some cases!
PASS 44 test-hbitmap /hbitmap/next_dirty_area/next_dirty_area_4
PASS 45 test-hbitmap /hbitmap/next_dirty_area/next_dirty_area_after_truncate
MALLOC_PERTURB_=${MALLOC_PERTURB_:-$(( ${RANDOM:-0} % 255 + 1))}  
tests/test-bdrv-drain -m=quick -k --tap < /dev/null | ./scripts/tap-driver.pl 
--test-name="test-bdrv-drain" 
==6374==WARNING: ASan doesn't fully support makecontext/swapcontext functions 
and may produce false positives in some cases!
PASS 1 test-bdrv-drain /bdrv-drain/nested
PASS 2 test-bdrv-drain /bdrv-drain/multiparent
PASS 3 test-bdrv-drain /bdrv-drain/set_aio_context
---
PASS 41 test-bdrv-drain /bdrv-drain/bdrv_drop_intermediate/poll
PASS 42 test-bdrv-drain /bdrv-drain/replace_child/mid-drain
MALLOC_PERTURB_=${MALLOC_PERTURB_:-$(( ${RANDOM:-0} % 255 + 1))}  
tests/test-bdrv-graph-mod -m=quick -k --tap < /dev/null | 
./scripts/tap-driver.pl --test-name="test-bdrv-graph-mod" 
==6413==WARNING: ASan doesn't fully support makecontext/swapcontext functions 
and may produce false positives in some cases!
PASS 1 test-bdrv-graph-mod /bdrv-graph-mod/update-perm-tree
PASS 2 test-bdrv-graph-mod /bdrv-graph-mod/should-update-child
MALLOC_PERTURB_=${MALLOC_PERTURB_:-$(( ${RANDOM:-0} % 255 + 1))}  
tests/test-blockjob -m=quick -k --tap < /dev/null | ./scripts/tap-driver.pl 
--test-name="test-blockjob" 
==6417==WARNING: ASan doesn't fully support makecontext/swapcontext functions 
and may produce false positives in some cases!
PASS 1 test-blockjob /blockjob/ids
PASS 2 test-blockjob /blockjob/cancel/created
PASS 3 test-blockjob /blockjob/cancel/running
---
PASS 7 test-blockjob /blockjob/cancel/pending
PASS 8 test-blockjob /blockjob/cancel/concluded
MALLOC_PERTURB_=${MALLOC_PERTURB_:-$(( ${RANDOM:-0} % 255 + 1))}  
tests/test-blockjob-txn -m=quick -k --tap < /dev/null | ./scripts/tap-driver.pl 
--test-name="test-blockjob-txn" 
==6421==WARNING: ASan doesn't fully support makecontext/swapcontext functions 
and may produce false positives in some cases!
PASS 1 test-blockjob-txn /single/success
PASS 2 test-blockjob-txn /single/failure
PASS 3 test-blockjob-txn /single/cancel
---
PASS 6 test-blockjob-txn /pair/cancel
PASS 7 test-blockjob-txn /pair/fail-cancel-race
MALLOC_PERTURB_=${MALLOC_PERTURB_:-$(( ${RANDOM:-0} % 255 + 1))}  
tests/test-block-backend -m=quick -k --tap < /dev/null | 
./scripts/tap-driver.pl --test-name="test-block-backend" 
==6425==WARNING: ASan doesn't fully support makecontext/swapcontext functions 
and may produce false positives in some cases!
PASS 1 test-block-backend /block-backend/drain_aio_error
PASS 2 test-block-backend /block-backend/drain_all_aio_error
MALLOC_PERTURB_=${MALLOC_PERTURB_:-$(( ${RANDOM:-0} % 255 + 1))}  
tests/test-block-iothread -m=quick -k --tap < /dev/null | 
./scripts/tap-driver.pl --test-name="test-block-iothread" 
==6429==WARNING: ASan doesn't fully support makecontext/swapcontext functions 
and may produce false positives in some cases!
PASS 1 test-block-iothread /sync-op/pread
PASS 2 test-block-iothread /sync-op/pwrite
PASS 3 test-block-iothread /sync-op/load_vmstate
---
PASS 15 test-block-iothread /propagate/diamond
PASS 16 test-block-iothread /propagate/mirror
MALLOC_PERTURB_=${MALLOC_PERTURB_:-$(( ${RANDOM:-0} % 255 + 1))}  
tests/test-image-locking -m=quick -k --tap < /dev/null | 
./scripts/tap-driver.pl --test-name="test-image-locking" 
==6449==WARNING: ASan doesn't fully support makecontext/swapcontext functions 
and may produce false positives in some cases!
PASS 1 test-image-locking /image-locking/basic
PASS 2 test-image-locking /image-locking/set-perm-abort
MALLOC_PERTURB_=${MALLOC_PERTURB_:-$(( ${RANDOM:-0} % 255 + 1))}  
tests/test-x86-cpuid -m=quick -k --tap < /dev/null | ./scripts/tap-driver.pl 
--test-name="test-x86-cpuid" 
---
PASS 9 test-int128 /int128/int128_gt
PASS 10 test-int128 /int128/int128_rshift
MALLOC_PERTURB_=${MALLOC_PERTURB_:-$(( ${RANDOM:-0} % 255 + 1))}  
tests/rcutorture -m=quick -k --tap < /dev/null | ./scripts/tap-driver.pl 
--test-name="rcutorture" 
==6474==WARNING: ASan doesn't fully support makecontext/swapcontext functions 
and may produce false positives in some cases!
PASS 1 rcutorture /rcu/torture/1reader
PASS 2 rcutorture /rcu/torture/10readers
MALLOC_PERTURB_=${MALLOC_PERTURB_:-$(( ${RANDOM:-0} % 255 + 1))}  
tests/test-rcu-list -m=quick -k --tap < /dev/null | ./scripts/tap-driver.pl 
--test-name="test-rcu-list" 
---
PASS 2 test-rcu-list /rcu/qlist/short-few
PASS 3 test-rcu-list /rcu/qlist/long-many
MALLOC_PERTURB_=${MALLOC_PERTURB_:-$(( ${RANDOM:-0} % 255 + 1))}  
tests/test-rcu-simpleq -m=quick -k --tap < /dev/null | ./scripts/tap-driver.pl 
--test-name="test-rcu-simpleq" 
==6540==WARNING: ASan doesn't fully support makecontext/swapcontext functions 
and may produce false positives in some cases!
PASS 1 test-rcu-simpleq /rcu/qsimpleq/single-threaded
PASS 2 test-rcu-simpleq /rcu/qsimpleq/short-few
PASS 3 test-rcu-simpleq /rcu/qsimpleq/long-many
MALLOC_PERTURB_=${MALLOC_PERTURB_:-$(( ${RANDOM:-0} % 255 + 1))}  
tests/test-rcu-tailq -m=quick -k --tap < /dev/null | ./scripts/tap-driver.pl 
--test-name="test-rcu-tailq" 
PASS 1 test-rcu-tailq /rcu/qtailq/single-threaded
==6585==WARNING: ASan doesn't fully support makecontext/swapcontext functions 
and may produce false positives in some cases!
PASS 2 test-rcu-tailq /rcu/qtailq/short-few
PASS 3 test-rcu-tailq /rcu/qtailq/long-many
MALLOC_PERTURB_=${MALLOC_PERTURB_:-$(( ${RANDOM:-0} % 255 + 1))}  
tests/test-rcu-slist -m=quick -k --tap < /dev/null | ./scripts/tap-driver.pl 
--test-name="test-rcu-slist" 
PASS 1 test-rcu-slist /rcu/qslist/single-threaded
PASS 2 test-rcu-slist /rcu/qslist/short-few
==6651==WARNING: ASan doesn't fully support makecontext/swapcontext functions 
and may produce false positives in some cases!
PASS 3 test-rcu-slist /rcu/qslist/long-many
MALLOC_PERTURB_=${MALLOC_PERTURB_:-$(( ${RANDOM:-0} % 255 + 1))}  
tests/test-qdist -m=quick -k --tap < /dev/null | ./scripts/tap-driver.pl 
--test-name="test-qdist" 
PASS 1 test-qdist /qdist/none
---
PASS 8 test-qdist /qdist/binning/shrink
MALLOC_PERTURB_=${MALLOC_PERTURB_:-$(( ${RANDOM:-0} % 255 + 1))}  
tests/test-qht -m=quick -k --tap < /dev/null | ./scripts/tap-driver.pl 
--test-name="test-qht" 
PASS 5 ide-test /x86_64/ide/bmdma/various_prdts
==6664==WARNING: ASan doesn't fully support makecontext/swapcontext functions 
and may produce false positives in some cases!
==6664==WARNING: ASan is ignoring requested __asan_handle_no_return: stack top: 
0x7ffcd17e5000; bottom 0x7f0c1cdfe000; size: 0x00f0b49e7000 (1033822433280)
False positive error reports may follow
For details see https://github.com/google/sanitizers/issues/189
PASS 6 ide-test /x86_64/ide/bmdma/no_busmaster
PASS 7 ide-test /x86_64/ide/flush/nodev
==6675==WARNING: ASan doesn't fully support makecontext/swapcontext functions 
and may produce false positives in some cases!
PASS 8 ide-test /x86_64/ide/flush/empty_drive
==6680==WARNING: ASan doesn't fully support makecontext/swapcontext functions 
and may produce false positives in some cases!
PASS 9 ide-test /x86_64/ide/flush/retry_pci
==6686==WARNING: ASan doesn't fully support makecontext/swapcontext functions 
and may produce false positives in some cases!
PASS 10 ide-test /x86_64/ide/flush/retry_isa
==6692==WARNING: ASan doesn't fully support makecontext/swapcontext functions 
and may produce false positives in some cases!
PASS 11 ide-test /x86_64/ide/cdrom/pio
==6698==WARNING: ASan doesn't fully support makecontext/swapcontext functions 
and may produce false positives in some cases!
PASS 12 ide-test /x86_64/ide/cdrom/pio_large
==6704==WARNING: ASan doesn't fully support makecontext/swapcontext functions 
and may produce false positives in some cases!
PASS 13 ide-test /x86_64/ide/cdrom/dma
MALLOC_PERTURB_=${MALLOC_PERTURB_:-$(( ${RANDOM:-0} % 255 + 1))}  
QTEST_QEMU_BINARY=x86_64-softmmu/qemu-system-x86_64 QTEST_QEMU_IMG=qemu-img 
tests/qtest/ahci-test -m=quick -k --tap < /dev/null | ./scripts/tap-driver.pl 
--test-name="ahci-test" 
==6718==WARNING: ASan doesn't fully support makecontext/swapcontext functions 
and may produce false positives in some cases!
PASS 1 ahci-test /x86_64/ahci/sanity
==6724==WARNING: ASan doesn't fully support makecontext/swapcontext functions 
and may produce false positives in some cases!
PASS 2 ahci-test /x86_64/ahci/pci_spec
==6730==WARNING: ASan doesn't fully support makecontext/swapcontext functions 
and may produce false positives in some cases!
PASS 3 ahci-test /x86_64/ahci/pci_enable
PASS 1 test-qht /qht/mode/default
==6736==WARNING: ASan doesn't fully support makecontext/swapcontext functions 
and may produce false positives in some cases!
PASS 2 test-qht /qht/mode/resize
MALLOC_PERTURB_=${MALLOC_PERTURB_:-$(( ${RANDOM:-0} % 255 + 1))}  
tests/test-qht-par -m=quick -k --tap < /dev/null | ./scripts/tap-driver.pl 
--test-name="test-qht-par" 
PASS 4 ahci-test /x86_64/ahci/hba_spec
==6747==WARNING: ASan doesn't fully support makecontext/swapcontext functions 
and may produce false positives in some cases!
PASS 5 ahci-test /x86_64/ahci/hba_enable
PASS 1 test-qht-par /qht/parallel/2threads-0%updates-1s
==6757==WARNING: ASan doesn't fully support makecontext/swapcontext functions 
and may produce false positives in some cases!
PASS 6 ahci-test /x86_64/ahci/identify
==6769==WARNING: ASan doesn't fully support makecontext/swapcontext functions 
and may produce false positives in some cases!
PASS 2 test-qht-par /qht/parallel/2threads-20%updates-1s
MALLOC_PERTURB_=${MALLOC_PERTURB_:-$(( ${RANDOM:-0} % 255 + 1))}  
tests/test-bitops -m=quick -k --tap < /dev/null | ./scripts/tap-driver.pl 
--test-name="test-bitops" 
PASS 7 ahci-test /x86_64/ahci/max
---
PASS 3 test-qdev-global-props /qdev/properties/dynamic/global
PASS 4 test-qdev-global-props /qdev/properties/global/subclass
MALLOC_PERTURB_=${MALLOC_PERTURB_:-$(( ${RANDOM:-0} % 255 + 1))}  
tests/check-qom-interface -m=quick -k --tap < /dev/null | 
./scripts/tap-driver.pl --test-name="check-qom-interface" 
==6778==WARNING: ASan doesn't fully support makecontext/swapcontext functions 
and may produce false positives in some cases!
PASS 1 check-qom-interface /qom/interface/direct_impl
PASS 2 check-qom-interface /qom/interface/intermediate_impl
MALLOC_PERTURB_=${MALLOC_PERTURB_:-$(( ${RANDOM:-0} % 255 + 1))}  
tests/check-qom-proplist -m=quick -k --tap < /dev/null | 
./scripts/tap-driver.pl --test-name="check-qom-proplist" 
---
PASS 4 test-write-threshold /write-threshold/not-trigger
PASS 5 test-write-threshold /write-threshold/trigger
MALLOC_PERTURB_=${MALLOC_PERTURB_:-$(( ${RANDOM:-0} % 255 + 1))}  
tests/test-crypto-hash -m=quick -k --tap < /dev/null | ./scripts/tap-driver.pl 
--test-name="test-crypto-hash" 
==6817==WARNING: ASan doesn't fully support makecontext/swapcontext functions 
and may produce false positives in some cases!
==6817==WARNING: ASan is ignoring requested __asan_handle_no_return: stack top: 
0x7fffcc63e000; bottom 0x7fbe003fe000; size: 0x0041cc240000 (282597785600)
False positive error reports may follow
For details see https://github.com/google/sanitizers/issues/189
PASS 1 test-crypto-hash /crypto/hash/iov
---
PASS 27 test-crypto-cipher /crypto/cipher/null-iv
PASS 28 test-crypto-cipher /crypto/cipher/short-plaintext
MALLOC_PERTURB_=${MALLOC_PERTURB_:-$(( ${RANDOM:-0} % 255 + 1))}  
tests/test-crypto-secret -m=quick -k --tap < /dev/null | 
./scripts/tap-driver.pl --test-name="test-crypto-secret" 
==6839==WARNING: ASan doesn't fully support makecontext/swapcontext functions 
and may produce false positives in some cases!
PASS 1 test-crypto-secret /crypto/secret/direct
PASS 2 test-crypto-secret /crypto/secret/indirect/good
PASS 3 test-crypto-secret /crypto/secret/indirect/badfile
---
PASS 15 test-crypto-secret /crypto/secret/crypt/missingiv
PASS 16 test-crypto-secret /crypto/secret/crypt/badiv
MALLOC_PERTURB_=${MALLOC_PERTURB_:-$(( ${RANDOM:-0} % 255 + 1))}  
tests/test-crypto-tlscredsx509 -m=quick -k --tap < /dev/null | 
./scripts/tap-driver.pl --test-name="test-crypto-tlscredsx509" 
==6839==WARNING: ASan is ignoring requested __asan_handle_no_return: stack top: 
0x7fff5f31d000; bottom 0x7f63865fe000; size: 0x009bd8d1f000 (669357568000)
False positive error reports may follow
For details see https://github.com/google/sanitizers/issues/189
PASS 10 ahci-test /x86_64/ahci/io/pio/lba28/simple/low
==6853==WARNING: ASan doesn't fully support makecontext/swapcontext functions 
and may produce false positives in some cases!
==6853==WARNING: ASan is ignoring requested __asan_handle_no_return: stack top: 
0x7ffda8df8000; bottom 0x7f719e7fe000; size: 0x008c0a5fa000 (601469460480)
False positive error reports may follow
For details see https://github.com/google/sanitizers/issues/189
PASS 11 ahci-test /x86_64/ahci/io/pio/lba28/simple/high
PASS 1 test-crypto-tlscredsx509 /qcrypto/tlscredsx509/perfectserver
PASS 2 test-crypto-tlscredsx509 /qcrypto/tlscredsx509/perfectclient
==6859==WARNING: ASan doesn't fully support makecontext/swapcontext functions 
and may produce false positives in some cases!
==6859==WARNING: ASan is ignoring requested __asan_handle_no_return: stack top: 
0x7fffcc6fe000; bottom 0x7fc6321fe000; size: 0x00399a500000 (247402070016)
False positive error reports may follow
For details see https://github.com/google/sanitizers/issues/189
PASS 12 ahci-test /x86_64/ahci/io/pio/lba28/double/zero
==6865==WARNING: ASan doesn't fully support makecontext/swapcontext functions 
and may produce false positives in some cases!
==6865==WARNING: ASan is ignoring requested __asan_handle_no_return: stack top: 
0x7ffcae6dd000; bottom 0x7f3b989fe000; size: 0x00c115cdf000 (829294505984)
False positive error reports may follow
For details see https://github.com/google/sanitizers/issues/189
PASS 13 ahci-test /x86_64/ahci/io/pio/lba28/double/low
PASS 3 test-crypto-tlscredsx509 /qcrypto/tlscredsx509/goodca1
==6871==WARNING: ASan doesn't fully support makecontext/swapcontext functions 
and may produce false positives in some cases!
PASS 4 test-crypto-tlscredsx509 /qcrypto/tlscredsx509/goodca2
==6871==WARNING: ASan is ignoring requested __asan_handle_no_return: stack top: 
0x7ffc708e2000; bottom 0x7fe14f7fe000; size: 0x001b210e4000 (116518699008)
False positive error reports may follow
For details see https://github.com/google/sanitizers/issues/189
PASS 5 test-crypto-tlscredsx509 /qcrypto/tlscredsx509/goodca3
---
PASS 14 ahci-test /x86_64/ahci/io/pio/lba28/double/high
PASS 9 test-crypto-tlscredsx509 /qcrypto/tlscredsx509/goodserver1
PASS 10 test-crypto-tlscredsx509 /qcrypto/tlscredsx509/goodserver2
==6877==WARNING: ASan doesn't fully support makecontext/swapcontext functions 
and may produce false positives in some cases!
==6877==WARNING: ASan is ignoring requested __asan_handle_no_return: stack top: 
0x7ffc52868000; bottom 0x7f7cf55fe000; size: 0x007f5d26a000 (547023659008)
False positive error reports may follow
For details see https://github.com/google/sanitizers/issues/189
PASS 15 ahci-test /x86_64/ahci/io/pio/lba28/long/zero
PASS 11 test-crypto-tlscredsx509 /qcrypto/tlscredsx509/goodserver3
PASS 12 test-crypto-tlscredsx509 /qcrypto/tlscredsx509/goodserver4
==6883==WARNING: ASan doesn't fully support makecontext/swapcontext functions 
and may produce false positives in some cases!
PASS 13 test-crypto-tlscredsx509 /qcrypto/tlscredsx509/goodserver5
==6883==WARNING: ASan is ignoring requested __asan_handle_no_return: stack top: 
0x7ffc80337000; bottom 0x7fe550f7c000; size: 0x00172f3bb000 (99576688640)
False positive error reports may follow
For details see https://github.com/google/sanitizers/issues/189
PASS 14 test-crypto-tlscredsx509 /qcrypto/tlscredsx509/goodserver6
---
PASS 32 test-crypto-tlscredsx509 /qcrypto/tlscredsx509/inactive1
PASS 33 test-crypto-tlscredsx509 /qcrypto/tlscredsx509/inactive2
PASS 34 test-crypto-tlscredsx509 /qcrypto/tlscredsx509/inactive3
==6889==WARNING: ASan doesn't fully support makecontext/swapcontext functions 
and may produce false positives in some cases!
==6889==WARNING: ASan is ignoring requested __asan_handle_no_return: stack top: 
0x7ffc98323000; bottom 0x7f5f1797c000; size: 0x009d809a7000 (676467470336)
False positive error reports may follow
For details see https://github.com/google/sanitizers/issues/189
PASS 35 test-crypto-tlscredsx509 /qcrypto/tlscredsx509/chain1
---
PASS 39 test-crypto-tlscredsx509 /qcrypto/tlscredsx509/missingclient
MALLOC_PERTURB_=${MALLOC_PERTURB_:-$(( ${RANDOM:-0} % 255 + 1))}  
tests/test-crypto-tlssession -m=quick -k --tap < /dev/null | 
./scripts/tap-driver.pl --test-name="test-crypto-tlssession" 
PASS 17 ahci-test /x86_64/ahci/io/pio/lba28/long/high
==6899==WARNING: ASan doesn't fully support makecontext/swapcontext functions 
and may produce false positives in some cases!
PASS 18 ahci-test /x86_64/ahci/io/pio/lba28/short/zero
PASS 1 test-crypto-tlssession /qcrypto/tlssession/psk
==6905==WARNING: ASan doesn't fully support makecontext/swapcontext functions 
and may produce false positives in some cases!
PASS 19 ahci-test /x86_64/ahci/io/pio/lba28/short/low
==6911==WARNING: ASan doesn't fully support makecontext/swapcontext functions 
and may produce false positives in some cases!
PASS 20 ahci-test /x86_64/ahci/io/pio/lba28/short/high
==6917==WARNING: ASan doesn't fully support makecontext/swapcontext functions 
and may produce false positives in some cases!
==6917==WARNING: ASan is ignoring requested __asan_handle_no_return: stack top: 
0x7fffe14d6000; bottom 0x7fa1c93fe000; size: 0x005e180d8000 (404130463744)
False positive error reports may follow
For details see https://github.com/google/sanitizers/issues/189
PASS 21 ahci-test /x86_64/ahci/io/pio/lba48/simple/zero
PASS 2 test-crypto-tlssession /qcrypto/tlssession/basicca
==6923==WARNING: ASan doesn't fully support makecontext/swapcontext functions 
and may produce false positives in some cases!
==6923==WARNING: ASan is ignoring requested __asan_handle_no_return: stack top: 
0x7ffe70ee0000; bottom 0x7fa5119fe000; size: 0x00595f4e2000 (383851044864)
False positive error reports may follow
For details see https://github.com/google/sanitizers/issues/189
PASS 22 ahci-test /x86_64/ahci/io/pio/lba48/simple/low
PASS 3 test-crypto-tlssession /qcrypto/tlssession/differentca
==6929==WARNING: ASan doesn't fully support makecontext/swapcontext functions 
and may produce false positives in some cases!
==6929==WARNING: ASan is ignoring requested __asan_handle_no_return: stack top: 
0x7ffe7721c000; bottom 0x7fea7cdfe000; size: 0x0013fa41e000 (85802999808)
False positive error reports may follow
For details see https://github.com/google/sanitizers/issues/189
PASS 23 ahci-test /x86_64/ahci/io/pio/lba48/simple/high
PASS 4 test-crypto-tlssession /qcrypto/tlssession/altname1
==6935==WARNING: ASan doesn't fully support makecontext/swapcontext functions 
and may produce false positives in some cases!
==6935==WARNING: ASan is ignoring requested __asan_handle_no_return: stack top: 
0x7ffc759b1000; bottom 0x7fb5107fe000; size: 0x0047651b3000 (306638958592)
False positive error reports may follow
For details see https://github.com/google/sanitizers/issues/189
PASS 5 test-crypto-tlssession /qcrypto/tlssession/altname2
PASS 24 ahci-test /x86_64/ahci/io/pio/lba48/double/zero
PASS 6 test-crypto-tlssession /qcrypto/tlssession/altname3
==6941==WARNING: ASan doesn't fully support makecontext/swapcontext functions 
and may produce false positives in some cases!
PASS 7 test-crypto-tlssession /qcrypto/tlssession/altname4
==6941==WARNING: ASan is ignoring requested __asan_handle_no_return: stack top: 
0x7fff6b1f3000; bottom 0x7fadc91fe000; size: 0x0051a1ff5000 (350610214912)
False positive error reports may follow
For details see https://github.com/google/sanitizers/issues/189
PASS 8 test-crypto-tlssession /qcrypto/tlssession/altname5
PASS 25 ahci-test /x86_64/ahci/io/pio/lba48/double/low
PASS 9 test-crypto-tlssession /qcrypto/tlssession/altname6
==6947==WARNING: ASan doesn't fully support makecontext/swapcontext functions 
and may produce false positives in some cases!
==6947==WARNING: ASan is ignoring requested __asan_handle_no_return: stack top: 
0x7ffff028f000; bottom 0x7f0a569fe000; size: 0x00f599891000 (1054842884096)
False positive error reports may follow
For details see https://github.com/google/sanitizers/issues/189
PASS 10 test-crypto-tlssession /qcrypto/tlssession/wildcard1
---
PASS 16 test-crypto-tlssession /qcrypto/tlssession/cachain
MALLOC_PERTURB_=${MALLOC_PERTURB_:-$(( ${RANDOM:-0} % 255 + 1))}  
tests/test-qga -m=quick -k --tap < /dev/null | ./scripts/tap-driver.pl 
--test-name="test-qga" 
PASS 26 ahci-test /x86_64/ahci/io/pio/lba48/double/high
==6956==WARNING: ASan doesn't fully support makecontext/swapcontext functions 
and may produce false positives in some cases!
==6956==WARNING: ASan is ignoring requested __asan_handle_no_return: stack top: 
0x7ffdd8e54000; bottom 0x7f4dfe97c000; size: 0x00afda4d8000 (755281788928)
False positive error reports may follow
For details see https://github.com/google/sanitizers/issues/189
PASS 27 ahci-test /x86_64/ahci/io/pio/lba48/long/zero
==6967==WARNING: ASan doesn't fully support makecontext/swapcontext functions 
and may produce false positives in some cases!
PASS 1 test-qga /qga/sync-delimited
PASS 2 test-qga /qga/sync
PASS 3 test-qga /qga/ping
==6967==WARNING: ASan is ignoring requested __asan_handle_no_return: stack top: 
0x7ffd7defa000; bottom 0x7f96135fe000; size: 0x00676a8fc000 (444169437184)
False positive error reports may follow
For details see https://github.com/google/sanitizers/issues/189
PASS 4 test-qga /qga/info
---
PASS 16 test-qga /qga/invalid-args
PASS 17 test-qga /qga/fsfreeze-status
PASS 28 ahci-test /x86_64/ahci/io/pio/lba48/long/low
==6976==WARNING: ASan doesn't fully support makecontext/swapcontext functions 
and may produce false positives in some cases!
==6976==WARNING: ASan is ignoring requested __asan_handle_no_return: stack top: 
0x7ffca5921000; bottom 0x7fbf8e57c000; size: 0x003d173a5000 (262382702592)
False positive error reports may follow
For details see https://github.com/google/sanitizers/issues/189
PASS 18 test-qga /qga/blacklist
---
PASS 20 test-qga /qga/guest-exec
PASS 21 test-qga /qga/guest-exec-invalid
PASS 29 ahci-test /x86_64/ahci/io/pio/lba48/long/high
==6994==WARNING: ASan doesn't fully support makecontext/swapcontext functions 
and may produce false positives in some cases!
PASS 22 test-qga /qga/guest-get-osinfo
PASS 23 test-qga /qga/guest-get-host-name
PASS 24 test-qga /qga/guest-get-timezone
---
MALLOC_PERTURB_=${MALLOC_PERTURB_:-$(( ${RANDOM:-0} % 255 + 1))}  
tests/test-util-filemonitor -m=quick -k --tap < /dev/null | 
./scripts/tap-driver.pl --test-name="test-util-filemonitor" 
PASS 1 test-util-filemonitor /util/filemonitor
MALLOC_PERTURB_=${MALLOC_PERTURB_:-$(( ${RANDOM:-0} % 255 + 1))}  
tests/test-util-sockets -m=quick -k --tap < /dev/null | ./scripts/tap-driver.pl 
--test-name="test-util-sockets" 
==7004==WARNING: ASan doesn't fully support makecontext/swapcontext functions 
and may produce false positives in some cases!
PASS 1 test-util-sockets /util/socket/is-socket/bad
PASS 2 test-util-sockets /util/socket/is-socket/good
PASS 3 test-util-sockets /socket/fd-pass/name/good
---
PASS 5 test-authz-list /auth/list/explicit/deny
PASS 6 test-authz-list /auth/list/explicit/allow
MALLOC_PERTURB_=${MALLOC_PERTURB_:-$(( ${RANDOM:-0} % 255 + 1))}  
tests/test-authz-listfile -m=quick -k --tap < /dev/null | 
./scripts/tap-driver.pl --test-name="test-authz-listfile" 
==7024==WARNING: ASan doesn't fully support makecontext/swapcontext functions 
and may produce false positives in some cases!
PASS 1 test-authz-listfile /auth/list/complex
PASS 2 test-authz-listfile /auth/list/default/deny
PASS 3 test-authz-listfile /auth/list/default/allow
---
PASS 4 test-io-channel-file /io/channel/pipe/sync
PASS 5 test-io-channel-file /io/channel/pipe/async
MALLOC_PERTURB_=${MALLOC_PERTURB_:-$(( ${RANDOM:-0} % 255 + 1))}  
tests/test-io-channel-tls -m=quick -k --tap < /dev/null | 
./scripts/tap-driver.pl --test-name="test-io-channel-tls" 
==7081==WARNING: ASan doesn't fully support makecontext/swapcontext functions 
and may produce false positives in some cases!
PASS 33 ahci-test /x86_64/ahci/io/dma/lba28/fragmented
PASS 1 test-io-channel-tls /qio/channel/tls/basic
MALLOC_PERTURB_=${MALLOC_PERTURB_:-$(( ${RANDOM:-0} % 255 + 1))}  
tests/test-io-channel-command -m=quick -k --tap < /dev/null | 
./scripts/tap-driver.pl --test-name="test-io-channel-command" 
==7102==WARNING: ASan doesn't fully support makecontext/swapcontext functions 
and may produce false positives in some cases!
PASS 1 test-io-channel-command /io/channel/command/fifo/sync
PASS 2 test-io-channel-command /io/channel/command/fifo/async
PASS 3 test-io-channel-command /io/channel/command/echo/sync
---
PASS 8 test-crypto-ivgen /crypto/ivgen/essiv/1f2e3d4c
PASS 9 test-crypto-ivgen /crypto/ivgen/essiv/1f2e3d4c5b6a7988
MALLOC_PERTURB_=${MALLOC_PERTURB_:-$(( ${RANDOM:-0} % 255 + 1))}  
tests/test-crypto-afsplit -m=quick -k --tap < /dev/null | 
./scripts/tap-driver.pl --test-name="test-crypto-afsplit" 
==7123==WARNING: ASan doesn't fully support makecontext/swapcontext functions 
and may produce false positives in some cases!
PASS 1 test-crypto-afsplit /crypto/afsplit/sha256/5
PASS 2 test-crypto-afsplit /crypto/afsplit/sha256/5000
PASS 3 test-crypto-afsplit /crypto/afsplit/sha256/big
---
PASS 17 test-crypto-xts /crypto/xts/t-21-key-32-ptx-31/basic
PASS 18 test-crypto-xts /crypto/xts/t-21-key-32-ptx-31/unaligned
MALLOC_PERTURB_=${MALLOC_PERTURB_:-$(( ${RANDOM:-0} % 255 + 1))}  
tests/test-crypto-block -m=quick -k --tap < /dev/null | ./scripts/tap-driver.pl 
--test-name="test-crypto-block" 
==7145==WARNING: ASan doesn't fully support makecontext/swapcontext functions 
and may produce false positives in some cases!
PASS 1 test-crypto-block /crypto/block/qcow
MALLOC_PERTURB_=${MALLOC_PERTURB_:-$(( ${RANDOM:-0} % 255 + 1))}  
tests/test-logging -m=quick -k --tap < /dev/null | ./scripts/tap-driver.pl 
--test-name="test-logging" 
PASS 1 test-logging /logging/parse_range
---
PASS 4 test-logging /logging/logfile_lock_path
MALLOC_PERTURB_=${MALLOC_PERTURB_:-$(( ${RANDOM:-0} % 255 + 1))}  
tests/test-replication -m=quick -k --tap < /dev/null | ./scripts/tap-driver.pl 
--test-name="test-replication" 
PASS 36 ahci-test /x86_64/ahci/io/dma/lba28/simple/low
==7160==WARNING: ASan doesn't fully support makecontext/swapcontext functions 
and may produce false positives in some cases!
==7162==WARNING: ASan doesn't fully support makecontext/swapcontext functions 
and may produce false positives in some cases!
PASS 1 test-replication /replication/primary/read
PASS 37 ahci-test /x86_64/ahci/io/dma/lba28/simple/high
PASS 2 test-replication /replication/primary/write
==7170==WARNING: ASan doesn't fully support makecontext/swapcontext functions 
and may produce false positives in some cases!
PASS 3 test-replication /replication/primary/start
PASS 38 ahci-test /x86_64/ahci/io/dma/lba28/double/zero
PASS 4 test-replication /replication/primary/stop
PASS 5 test-replication /replication/primary/do_checkpoint
PASS 6 test-replication /replication/primary/get_error_all
==7176==WARNING: ASan doesn't fully support makecontext/swapcontext functions 
and may produce false positives in some cases!
PASS 7 test-replication /replication/secondary/read
PASS 39 ahci-test /x86_64/ahci/io/dma/lba28/double/low
==7182==WARNING: ASan doesn't fully support makecontext/swapcontext functions 
and may produce false positives in some cases!
PASS 8 test-replication /replication/secondary/write
PASS 40 ahci-test /x86_64/ahci/io/dma/lba28/double/high
==7188==WARNING: ASan doesn't fully support makecontext/swapcontext functions 
and may produce false positives in some cases!
==7188==WARNING: ASan is ignoring requested __asan_handle_no_return: stack top: 
0x7ffd2897d000; bottom 0x7f90d43fd000; size: 0x006c54580000 (465271521280)
False positive error reports may follow
For details see https://github.com/google/sanitizers/issues/189
PASS 41 ahci-test /x86_64/ahci/io/dma/lba28/long/zero
==7195==WARNING: ASan doesn't fully support makecontext/swapcontext functions 
and may produce false positives in some cases!
==7195==WARNING: ASan is ignoring requested __asan_handle_no_return: stack top: 
0x7ffeca351000; bottom 0x7fc3e1ffd000; size: 0x003ae8354000 (253003907072)
False positive error reports may follow
For details see https://github.com/google/sanitizers/issues/189
PASS 42 ahci-test /x86_64/ahci/io/dma/lba28/long/low
==7203==WARNING: ASan doesn't fully support makecontext/swapcontext functions 
and may produce false positives in some cases!
==7160==WARNING: ASan is ignoring requested __asan_handle_no_return: stack top: 
0x7ffe35082000; bottom 0x7f81fe40c000; size: 0x007c36c76000 (533494980608)
False positive error reports may follow
For details see https://github.com/google/sanitizers/issues/189
==7203==WARNING: ASan is ignoring requested __asan_handle_no_return: stack top: 
0x7ffc14fd0000; bottom 0x7f26d7923000; size: 0x00d53d6ad000 (915858444288)
False positive error reports may follow
For details see https://github.com/google/sanitizers/issues/189
PASS 9 test-replication /replication/secondary/start
PASS 43 ahci-test /x86_64/ahci/io/dma/lba28/long/high
==7231==WARNING: ASan doesn't fully support makecontext/swapcontext functions 
and may produce false positives in some cases!
PASS 44 ahci-test /x86_64/ahci/io/dma/lba28/short/zero
==7237==WARNING: ASan doesn't fully support makecontext/swapcontext functions 
and may produce false positives in some cases!
PASS 45 ahci-test /x86_64/ahci/io/dma/lba28/short/low
==7243==WARNING: ASan doesn't fully support makecontext/swapcontext functions 
and may produce false positives in some cases!
PASS 46 ahci-test /x86_64/ahci/io/dma/lba28/short/high
PASS 10 test-replication /replication/secondary/stop
==7249==WARNING: ASan doesn't fully support makecontext/swapcontext functions 
and may produce false positives in some cases!
PASS 47 ahci-test /x86_64/ahci/io/dma/lba48/simple/zero
==7255==WARNING: ASan doesn't fully support makecontext/swapcontext functions 
and may produce false positives in some cases!
PASS 48 ahci-test /x86_64/ahci/io/dma/lba48/simple/low
==7261==WARNING: ASan doesn't fully support makecontext/swapcontext functions 
and may produce false positives in some cases!
PASS 49 ahci-test /x86_64/ahci/io/dma/lba48/simple/high
PASS 11 test-replication /replication/secondary/continuous_replication
==7267==WARNING: ASan doesn't fully support makecontext/swapcontext functions 
and may produce false positives in some cases!
PASS 50 ahci-test /x86_64/ahci/io/dma/lba48/double/zero
==7273==WARNING: ASan doesn't fully support makecontext/swapcontext functions 
and may produce false positives in some cases!
PASS 51 ahci-test /x86_64/ahci/io/dma/lba48/double/low
==7279==WARNING: ASan doesn't fully support makecontext/swapcontext functions 
and may produce false positives in some cases!
PASS 12 test-replication /replication/secondary/do_checkpoint
PASS 52 ahci-test /x86_64/ahci/io/dma/lba48/double/high
==7285==WARNING: ASan doesn't fully support makecontext/swapcontext functions 
and may produce false positives in some cases!
==7285==WARNING: ASan is ignoring requested __asan_handle_no_return: stack top: 
0x7fff80918000; bottom 0x7f1364bfd000; size: 0x00ec1bd1b000 (1014079008768)
False positive error reports may follow
For details see https://github.com/google/sanitizers/issues/189
PASS 13 test-replication /replication/secondary/get_error_all
PASS 53 ahci-test /x86_64/ahci/io/dma/lba48/long/zero
MALLOC_PERTURB_=${MALLOC_PERTURB_:-$(( ${RANDOM:-0} % 255 + 1))}  
tests/test-bufferiszero -m=quick -k --tap < /dev/null | ./scripts/tap-driver.pl 
--test-name="test-bufferiszero" 
==7292==WARNING: ASan doesn't fully support makecontext/swapcontext functions 
and may produce false positives in some cases!
==7292==WARNING: ASan is ignoring requested __asan_handle_no_return: stack top: 
0x7ffd4bfd2000; bottom 0x7fecec5fd000; size: 0x00105f9d5000 (70323621888)
False positive error reports may follow
For details see https://github.com/google/sanitizers/issues/189
PASS 54 ahci-test /x86_64/ahci/io/dma/lba48/long/low
==7302==WARNING: ASan doesn't fully support makecontext/swapcontext functions 
and may produce false positives in some cases!
==7302==WARNING: ASan is ignoring requested __asan_handle_no_return: stack top: 
0x7ffe54b0b000; bottom 0x7f7b0fdfd000; size: 0x008344d0e000 (563795255296)
False positive error reports may follow
For details see https://github.com/google/sanitizers/issues/189
PASS 55 ahci-test /x86_64/ahci/io/dma/lba48/long/high
==7309==WARNING: ASan doesn't fully support makecontext/swapcontext functions 
and may produce false positives in some cases!
PASS 56 ahci-test /x86_64/ahci/io/dma/lba48/short/zero
==7315==WARNING: ASan doesn't fully support makecontext/swapcontext functions 
and may produce false positives in some cases!
PASS 57 ahci-test /x86_64/ahci/io/dma/lba48/short/low
==7321==WARNING: ASan doesn't fully support makecontext/swapcontext functions 
and may produce false positives in some cases!
PASS 58 ahci-test /x86_64/ahci/io/dma/lba48/short/high
==7327==WARNING: ASan doesn't fully support makecontext/swapcontext functions 
and may produce false positives in some cases!
PASS 59 ahci-test /x86_64/ahci/io/ncq/simple
==7333==WARNING: ASan doesn't fully support makecontext/swapcontext functions 
and may produce false positives in some cases!
PASS 60 ahci-test /x86_64/ahci/io/ncq/retry
==7339==WARNING: ASan doesn't fully support makecontext/swapcontext functions 
and may produce false positives in some cases!
PASS 61 ahci-test /x86_64/ahci/flush/simple
==7345==WARNING: ASan doesn't fully support makecontext/swapcontext functions 
and may produce false positives in some cases!
PASS 62 ahci-test /x86_64/ahci/flush/retry
==7351==WARNING: ASan doesn't fully support makecontext/swapcontext functions 
and may produce false positives in some cases!
==7357==WARNING: ASan doesn't fully support makecontext/swapcontext functions 
and may produce false positives in some cases!
PASS 63 ahci-test /x86_64/ahci/flush/migrate
==7365==WARNING: ASan doesn't fully support makecontext/swapcontext functions 
and may produce false positives in some cases!
==7371==WARNING: ASan doesn't fully support makecontext/swapcontext functions 
and may produce false positives in some cases!
PASS 64 ahci-test /x86_64/ahci/migrate/sanity
==7379==WARNING: ASan doesn't fully support makecontext/swapcontext functions 
and may produce false positives in some cases!
==7385==WARNING: ASan doesn't fully support makecontext/swapcontext functions 
and may produce false positives in some cases!
PASS 65 ahci-test /x86_64/ahci/migrate/dma/simple
==7393==WARNING: ASan doesn't fully support makecontext/swapcontext functions 
and may produce false positives in some cases!
==7399==WARNING: ASan doesn't fully support makecontext/swapcontext functions 
and may produce false positives in some cases!
PASS 66 ahci-test /x86_64/ahci/migrate/dma/halted
==7407==WARNING: ASan doesn't fully support makecontext/swapcontext functions 
and may produce false positives in some cases!
==7413==WARNING: ASan doesn't fully support makecontext/swapcontext functions 
and may produce false positives in some cases!
PASS 67 ahci-test /x86_64/ahci/migrate/ncq/simple
==7421==WARNING: ASan doesn't fully support makecontext/swapcontext functions 
and may produce false positives in some cases!
==7427==WARNING: ASan doesn't fully support makecontext/swapcontext functions 
and may produce false positives in some cases!
PASS 68 ahci-test /x86_64/ahci/migrate/ncq/halted
==7435==WARNING: ASan doesn't fully support makecontext/swapcontext functions 
and may produce false positives in some cases!
PASS 69 ahci-test /x86_64/ahci/cdrom/eject
==7440==WARNING: ASan doesn't fully support makecontext/swapcontext functions 
and may produce false positives in some cases!
PASS 70 ahci-test /x86_64/ahci/cdrom/dma/single
==7446==WARNING: ASan doesn't fully support makecontext/swapcontext functions 
and may produce false positives in some cases!
PASS 71 ahci-test /x86_64/ahci/cdrom/dma/multi
==7452==WARNING: ASan doesn't fully support makecontext/swapcontext functions 
and may produce false positives in some cases!
PASS 72 ahci-test /x86_64/ahci/cdrom/pio/single
==7458==WARNING: ASan doesn't fully support makecontext/swapcontext functions 
and may produce false positives in some cases!
==7458==WARNING: ASan is ignoring requested __asan_handle_no_return: stack top: 
0x7ffc80b17000; bottom 0x7fa603dee000; size: 0x00567cd29000 (371461361664)
False positive error reports may follow
For details see https://github.com/google/sanitizers/issues/189
PASS 73 ahci-test /x86_64/ahci/cdrom/pio/multi
---
PASS 527 ptimer-test /ptimer/periodic_with_load_0 
policy=wrap_after_one_period,continuous_trigger,no_immediate_reload,no_counter_rounddown,trigger_only_on_decrement,
PASS 528 ptimer-test /ptimer/oneshot_with_load_0 
policy=wrap_after_one_period,continuous_trigger,no_immediate_reload,no_counter_rounddown,trigger_only_on_decrement,
MALLOC_PERTURB_=${MALLOC_PERTURB_:-$(( ${RANDOM:-0} % 255 + 1))}  
tests/test-qapi-util -m=quick -k --tap < /dev/null | ./scripts/tap-driver.pl 
--test-name="test-qapi-util" 
==7464==WARNING: ASan doesn't fully support makecontext/swapcontext functions 
and may produce false positives in some cases!
PASS 74 ahci-test /x86_64/ahci/cdrom/pio/bcl
MALLOC_PERTURB_=${MALLOC_PERTURB_:-$(( ${RANDOM:-0} % 255 + 1))}  
QTEST_QEMU_BINARY=x86_64-softmmu/qemu-system-x86_64 QTEST_QEMU_IMG=qemu-img 
tests/qtest/hd-geo-test -m=quick -k --tap < /dev/null | ./scripts/tap-driver.pl 
--test-name="hd-geo-test" 
PASS 1 test-qapi-util /qapi/util/qapi_enum_parse
---
PASS 22 test-qgraph /qgraph/test_test_in_path
PASS 23 test-qgraph /qgraph/test_double_edge
PASS 1 hd-geo-test /x86_64/hd-geo/ide/none
==7491==WARNING: ASan doesn't fully support makecontext/swapcontext functions 
and may produce false positives in some cases!
PASS 2 hd-geo-test /x86_64/hd-geo/ide/drive/cd_0
==7497==WARNING: ASan doesn't fully support makecontext/swapcontext functions 
and may produce false positives in some cases!
PASS 3 hd-geo-test /x86_64/hd-geo/ide/drive/mbr/blank
==7503==WARNING: ASan doesn't fully support makecontext/swapcontext functions 
and may produce false positives in some cases!
PASS 4 hd-geo-test /x86_64/hd-geo/ide/drive/mbr/lba
==7509==WARNING: ASan doesn't fully support makecontext/swapcontext functions 
and may produce false positives in some cases!
PASS 5 hd-geo-test /x86_64/hd-geo/ide/drive/mbr/chs
==7515==WARNING: ASan doesn't fully support makecontext/swapcontext functions 
and may produce false positives in some cases!
PASS 6 hd-geo-test /x86_64/hd-geo/ide/device/mbr/blank
==7521==WARNING: ASan doesn't fully support makecontext/swapcontext functions 
and may produce false positives in some cases!
PASS 7 hd-geo-test /x86_64/hd-geo/ide/device/mbr/lba
==7527==WARNING: ASan doesn't fully support makecontext/swapcontext functions 
and may produce false positives in some cases!
PASS 8 hd-geo-test /x86_64/hd-geo/ide/device/mbr/chs
==7533==WARNING: ASan doesn't fully support makecontext/swapcontext functions 
and may produce false positives in some cases!
PASS 9 hd-geo-test /x86_64/hd-geo/ide/device/user/chs
==7538==WARNING: ASan doesn't fully support makecontext/swapcontext functions 
and may produce false positives in some cases!
PASS 10 hd-geo-test /x86_64/hd-geo/ide/device/user/chst
==7544==WARNING: ASan doesn't fully support makecontext/swapcontext functions 
and may produce false positives in some cases!
==7548==WARNING: ASan doesn't fully support makecontext/swapcontext functions 
and may produce false positives in some cases!
==7552==WARNING: ASan doesn't fully support makecontext/swapcontext functions 
and may produce false positives in some cases!
==7556==WARNING: ASan doesn't fully support makecontext/swapcontext functions 
and may produce false positives in some cases!
==7560==WARNING: ASan doesn't fully support makecontext/swapcontext functions 
and may produce false positives in some cases!
==7564==WARNING: ASan doesn't fully support makecontext/swapcontext functions 
and may produce false positives in some cases!
==7568==WARNING: ASan doesn't fully support makecontext/swapcontext functions 
and may produce false positives in some cases!
==7572==WARNING: ASan doesn't fully support makecontext/swapcontext functions 
and may produce false positives in some cases!
==7575==WARNING: ASan doesn't fully support makecontext/swapcontext functions 
and may produce false positives in some cases!
PASS 11 hd-geo-test /x86_64/hd-geo/override/ide
==7582==WARNING: ASan doesn't fully support makecontext/swapcontext functions 
and may produce false positives in some cases!
==7586==WARNING: ASan doesn't fully support makecontext/swapcontext functions 
and may produce false positives in some cases!
==7590==WARNING: ASan doesn't fully support makecontext/swapcontext functions 
and may produce false positives in some cases!
==7594==WARNING: ASan doesn't fully support makecontext/swapcontext functions 
and may produce false positives in some cases!
==7598==WARNING: ASan doesn't fully support makecontext/swapcontext functions 
and may produce false positives in some cases!
==7602==WARNING: ASan doesn't fully support makecontext/swapcontext functions 
and may produce false positives in some cases!
==7606==WARNING: ASan doesn't fully support makecontext/swapcontext functions 
and may produce false positives in some cases!
==7610==WARNING: ASan doesn't fully support makecontext/swapcontext functions 
and may produce false positives in some cases!
==7613==WARNING: ASan doesn't fully support makecontext/swapcontext functions 
and may produce false positives in some cases!
PASS 12 hd-geo-test /x86_64/hd-geo/override/scsi
==7620==WARNING: ASan doesn't fully support makecontext/swapcontext functions 
and may produce false positives in some cases!
==7624==WARNING: ASan doesn't fully support makecontext/swapcontext functions 
and may produce false positives in some cases!
==7628==WARNING: ASan doesn't fully support makecontext/swapcontext functions 
and may produce false positives in some cases!
==7632==WARNING: ASan doesn't fully support makecontext/swapcontext functions 
and may produce false positives in some cases!
==7636==WARNING: ASan doesn't fully support makecontext/swapcontext functions 
and may produce false positives in some cases!
==7640==WARNING: ASan doesn't fully support makecontext/swapcontext functions 
and may produce false positives in some cases!
==7644==WARNING: ASan doesn't fully support makecontext/swapcontext functions 
and may produce false positives in some cases!
==7648==WARNING: ASan doesn't fully support makecontext/swapcontext functions 
and may produce false positives in some cases!
==7651==WARNING: ASan doesn't fully support makecontext/swapcontext functions 
and may produce false positives in some cases!
PASS 13 hd-geo-test /x86_64/hd-geo/override/scsi_2_controllers
==7658==WARNING: ASan doesn't fully support makecontext/swapcontext functions 
and may produce false positives in some cases!
==7662==WARNING: ASan doesn't fully support makecontext/swapcontext functions 
and may produce false positives in some cases!
==7666==WARNING: ASan doesn't fully support makecontext/swapcontext functions 
and may produce false positives in some cases!
==7670==WARNING: ASan doesn't fully support makecontext/swapcontext functions 
and may produce false positives in some cases!
==7673==WARNING: ASan doesn't fully support makecontext/swapcontext functions 
and may produce false positives in some cases!
PASS 14 hd-geo-test /x86_64/hd-geo/override/virtio_blk
==7680==WARNING: ASan doesn't fully support makecontext/swapcontext functions 
and may produce false positives in some cases!
==7684==WARNING: ASan doesn't fully support makecontext/swapcontext functions 
and may produce false positives in some cases!
==7687==WARNING: ASan doesn't fully support makecontext/swapcontext functions 
and may produce false positives in some cases!
PASS 15 hd-geo-test /x86_64/hd-geo/override/zero_chs
==7694==WARNING: ASan doesn't fully support makecontext/swapcontext functions 
and may produce false positives in some cases!
==7698==WARNING: ASan doesn't fully support makecontext/swapcontext functions 
and may produce false positives in some cases!
==7702==WARNING: ASan doesn't fully support makecontext/swapcontext functions 
and may produce false positives in some cases!
==7706==WARNING: ASan doesn't fully support makecontext/swapcontext functions 
and may produce false positives in some cases!
==7709==WARNING: ASan doesn't fully support makecontext/swapcontext functions 
and may produce false positives in some cases!
PASS 16 hd-geo-test /x86_64/hd-geo/override/scsi_hot_unplug
==7716==WARNING: ASan doesn't fully support makecontext/swapcontext functions 
and may produce false positives in some cases!
==7720==WARNING: ASan doesn't fully support makecontext/swapcontext functions 
and may produce false positives in some cases!
==7724==WARNING: ASan doesn't fully support makecontext/swapcontext functions 
and may produce false positives in some cases!
==7728==WARNING: ASan doesn't fully support makecontext/swapcontext functions 
and may produce false positives in some cases!
==7731==WARNING: ASan doesn't fully support makecontext/swapcontext functions 
and may produce false positives in some cases!
PASS 17 hd-geo-test /x86_64/hd-geo/override/virtio_hot_unplug
MALLOC_PERTURB_=${MALLOC_PERTURB_:-$(( ${RANDOM:-0} % 255 + 1))}  
QTEST_QEMU_BINARY=x86_64-softmmu/qemu-system-x86_64 QTEST_QEMU_IMG=qemu-img 
tests/qtest/boot-order-test -m=quick -k --tap < /dev/null | 
./scripts/tap-driver.pl --test-name="boot-order-test" 
PASS 1 boot-order-test /x86_64/boot-order/pc
---
Could not access KVM kernel module: No such file or directory
qemu-system-x86_64: -accel kvm: failed to initialize kvm: No such file or 
directory
qemu-system-x86_64: falling back to tcg
==7800==WARNING: ASan doesn't fully support makecontext/swapcontext functions 
and may produce false positives in some cases!

Looking for expected file 'tests/data/acpi/pc/FACP'
Using expected file 'tests/data/acpi/pc/FACP'
---
Could not access KVM kernel module: No such file or directory
qemu-system-x86_64: -accel kvm: failed to initialize kvm: No such file or 
directory
qemu-system-x86_64: falling back to tcg
==7806==WARNING: ASan doesn't fully support makecontext/swapcontext functions 
and may produce false positives in some cases!

Looking for expected file 'tests/data/acpi/q35/FACP'
Using expected file 'tests/data/acpi/q35/FACP'
---
Could not access KVM kernel module: No such file or directory
qemu-system-x86_64: -accel kvm: failed to initialize kvm: No such file or 
directory
qemu-system-x86_64: falling back to tcg
==7812==WARNING: ASan doesn't fully support makecontext/swapcontext functions 
and may produce false positives in some cases!

Looking for expected file 'tests/data/acpi/pc/FACP.bridge'
Looking for expected file 'tests/data/acpi/pc/FACP'
---
Could not access KVM kernel module: No such file or directory
qemu-system-x86_64: -accel kvm: failed to initialize kvm: No such file or 
directory
qemu-system-x86_64: falling back to tcg
==7818==WARNING: ASan doesn't fully support makecontext/swapcontext functions 
and may produce false positives in some cases!

Looking for expected file 'tests/data/acpi/pc/FACP.ipmikcs'
Looking for expected file 'tests/data/acpi/pc/FACP'
---
Could not access KVM kernel module: No such file or directory
qemu-system-x86_64: -accel kvm: failed to initialize kvm: No such file or 
directory
qemu-system-x86_64: falling back to tcg
==7824==WARNING: ASan doesn't fully support makecontext/swapcontext functions 
and may produce false positives in some cases!

Looking for expected file 'tests/data/acpi/pc/FACP.cphp'
Looking for expected file 'tests/data/acpi/pc/FACP'
---
Could not access KVM kernel module: No such file or directory
qemu-system-x86_64: -accel kvm: failed to initialize kvm: No such file or 
directory
qemu-system-x86_64: falling back to tcg
==7831==WARNING: ASan doesn't fully support makecontext/swapcontext functions 
and may produce false positives in some cases!

Looking for expected file 'tests/data/acpi/pc/FACP.memhp'
Looking for expected file 'tests/data/acpi/pc/FACP'
---
Could not access KVM kernel module: No such file or directory
qemu-system-x86_64: -accel kvm: failed to initialize kvm: No such file or 
directory
qemu-system-x86_64: falling back to tcg
==7837==WARNING: ASan doesn't fully support makecontext/swapcontext functions 
and may produce false positives in some cases!

Looking for expected file 'tests/data/acpi/pc/FACP.numamem'
Looking for expected file 'tests/data/acpi/pc/FACP'
---
Could not access KVM kernel module: No such file or directory
qemu-system-x86_64: -accel kvm: failed to initialize kvm: No such file or 
directory
qemu-system-x86_64: falling back to tcg
==7843==WARNING: ASan doesn't fully support makecontext/swapcontext functions 
and may produce false positives in some cases!

Looking for expected file 'tests/data/acpi/pc/FACP.dimmpxm'
Looking for expected file 'tests/data/acpi/pc/FACP'
---
Could not access KVM kernel module: No such file or directory
qemu-system-x86_64: -accel kvm: failed to initialize kvm: No such file or 
directory
qemu-system-x86_64: falling back to tcg
==7852==WARNING: ASan doesn't fully support makecontext/swapcontext functions 
and may produce false positives in some cases!

Looking for expected file 'tests/data/acpi/pc/FACP.acpihmat'
Looking for expected file 'tests/data/acpi/pc/FACP'
---
Could not access KVM kernel module: No such file or directory
qemu-system-x86_64: -accel kvm: failed to initialize kvm: No such file or 
directory
qemu-system-x86_64: falling back to tcg
==7859==WARNING: ASan doesn't fully support makecontext/swapcontext functions 
and may produce false positives in some cases!

Looking for expected file 'tests/data/acpi/q35/FACP.bridge'
Looking for expected file 'tests/data/acpi/q35/FACP'
---
Could not access KVM kernel module: No such file or directory
qemu-system-x86_64: -accel kvm: failed to initialize kvm: No such file or 
directory
qemu-system-x86_64: falling back to tcg
==7865==WARNING: ASan doesn't fully support makecontext/swapcontext functions 
and may produce false positives in some cases!

Looking for expected file 'tests/data/acpi/q35/FACP.mmio64'
Looking for expected file 'tests/data/acpi/q35/FACP'
---
Could not access KVM kernel module: No such file or directory
qemu-system-x86_64: -accel kvm: failed to initialize kvm: No such file or 
directory
qemu-system-x86_64: falling back to tcg
==7871==WARNING: ASan doesn't fully support makecontext/swapcontext functions 
and may produce false positives in some cases!

Looking for expected file 'tests/data/acpi/q35/FACP.ipmibt'
Looking for expected file 'tests/data/acpi/q35/FACP'
---
Could not access KVM kernel module: No such file or directory
qemu-system-x86_64: -accel kvm: failed to initialize kvm: No such file or 
directory
qemu-system-x86_64: falling back to tcg
==7877==WARNING: ASan doesn't fully support makecontext/swapcontext functions 
and may produce false positives in some cases!

Looking for expected file 'tests/data/acpi/q35/FACP.cphp'
Looking for expected file 'tests/data/acpi/q35/FACP'
---
Could not access KVM kernel module: No such file or directory
qemu-system-x86_64: -accel kvm: failed to initialize kvm: No such file or 
directory
qemu-system-x86_64: falling back to tcg
==7884==WARNING: ASan doesn't fully support makecontext/swapcontext functions 
and may produce false positives in some cases!

Looking for expected file 'tests/data/acpi/q35/FACP.memhp'
Looking for expected file 'tests/data/acpi/q35/FACP'
---
Could not access KVM kernel module: No such file or directory
qemu-system-x86_64: -accel kvm: failed to initialize kvm: No such file or 
directory
qemu-system-x86_64: falling back to tcg
==7890==WARNING: ASan doesn't fully support makecontext/swapcontext functions 
and may produce false positives in some cases!

Looking for expected file 'tests/data/acpi/q35/FACP.numamem'
Looking for expected file 'tests/data/acpi/q35/FACP'
---
Could not access KVM kernel module: No such file or directory
qemu-system-x86_64: -accel kvm: failed to initialize kvm: No such file or 
directory
qemu-system-x86_64: falling back to tcg
==7896==WARNING: ASan doesn't fully support makecontext/swapcontext functions 
and may produce false positives in some cases!

Looking for expected file 'tests/data/acpi/q35/FACP.dimmpxm'
Looking for expected file 'tests/data/acpi/q35/FACP'
---
Could not access KVM kernel module: No such file or directory
qemu-system-x86_64: -accel kvm: failed to initialize kvm: No such file or 
directory
qemu-system-x86_64: falling back to tcg
==7905==WARNING: ASan doesn't fully support makecontext/swapcontext functions 
and may produce false positives in some cases!

Looking for expected file 'tests/data/acpi/q35/FACP.acpihmat'
Looking for expected file 'tests/data/acpi/q35/FACP'
---
PASS 1 i440fx-test /x86_64/i440fx/defaults
PASS 2 i440fx-test /x86_64/i440fx/pam
PASS 3 i440fx-test /x86_64/i440fx/firmware/bios
==7997==WARNING: ASan doesn't fully support makecontext/swapcontext functions 
and may produce false positives in some cases!
PASS 4 i440fx-test /x86_64/i440fx/firmware/pflash
MALLOC_PERTURB_=${MALLOC_PERTURB_:-$(( ${RANDOM:-0} % 255 + 1))}  
QTEST_QEMU_BINARY=x86_64-softmmu/qemu-system-x86_64 QTEST_QEMU_IMG=qemu-img 
tests/qtest/fw_cfg-test -m=quick -k --tap < /dev/null | ./scripts/tap-driver.pl 
--test-name="fw_cfg-test" 
PASS 1 fw_cfg-test /x86_64/fw_cfg/signature
---
MALLOC_PERTURB_=${MALLOC_PERTURB_:-$(( ${RANDOM:-0} % 255 + 1))}  
QTEST_QEMU_BINARY=x86_64-softmmu/qemu-system-x86_64 QTEST_QEMU_IMG=qemu-img 
tests/qtest/drive_del-test -m=quick -k --tap < /dev/null | 
./scripts/tap-driver.pl --test-name="drive_del-test" 
PASS 1 drive_del-test /x86_64/drive_del/without-dev
PASS 2 drive_del-test /x86_64/drive_del/after_failed_device_add
==8090==WARNING: ASan doesn't fully support makecontext/swapcontext functions 
and may produce false positives in some cases!
PASS 3 drive_del-test /x86_64/blockdev/drive_del_device_del
MALLOC_PERTURB_=${MALLOC_PERTURB_:-$(( ${RANDOM:-0} % 255 + 1))}  
QTEST_QEMU_BINARY=x86_64-softmmu/qemu-system-x86_64 QTEST_QEMU_IMG=qemu-img 
tests/qtest/wdt_ib700-test -m=quick -k --tap < /dev/null | 
./scripts/tap-driver.pl --test-name="wdt_ib700-test" 
PASS 1 wdt_ib700-test /x86_64/wdt_ib700/pause
---
dbus-daemon[8260]: Could not get password database information for UID of 
current process: User "???" unknown or no memory to allocate password entry

**
ERROR:/tmp/qemu-test/src/tests/qtest/dbus-vmstate-test.c:114:get_connection: 
assertion failed (err == NULL): The connection is closed (g-io-error-quark, 18)
cleaning up pid 8260
ERROR - Bail out! 
ERROR:/tmp/qemu-test/src/tests/qtest/dbus-vmstate-test.c:114:get_connection: 
assertion failed (err == NULL): The connection is closed (g-io-error-quark, 18)
make: *** [/tmp/qemu-test/src/tests/Makefile.include:632: check-qtest-x86_64] 
Error 1
make: *** Waiting for unfinished jobs....
Traceback (most recent call last):
  File "./tests/docker/docker.py", line 664, in <module>
---
    raise CalledProcessError(retcode, cmd)
subprocess.CalledProcessError: Command '['sudo', '-n', 'docker', 'run', 
'--label', 'com.qemu.instance.uuid=3e9a045a5efd4bae80c1ed053f7e0446', '-u', 
'1003', '--security-opt', 'seccomp=unconfined', '--rm', '-e', 
'TARGET_LIST=x86_64-softmmu', '-e', 'EXTRA_CONFIGURE_OPTS=', '-e', 'V=', '-e', 
'J=14', '-e', 'DEBUG=', '-e', 'SHOW_ENV=', '-e', 'CCACHE_DIR=/var/tmp/ccache', 
'-v', '/home/patchew2/.cache/qemu-docker-ccache:/var/tmp/ccache:z', '-v', 
'/var/tmp/patchew-tester-tmp-5b4hzccz/src/docker-src.2020-03-10-12.45.21.24240:/var/tmp/qemu:z,ro',
 'qemu:fedora', '/var/tmp/qemu/run', 'test-debug']' returned non-zero exit 
status 2.
filter=--filter=label=com.qemu.instance.uuid=3e9a045a5efd4bae80c1ed053f7e0446
make[1]: *** [docker-run] Error 1
make[1]: Leaving directory `/var/tmp/patchew-tester-tmp-5b4hzccz/src'
make: *** [docker-run-test-debug@fedora] Error 2

real    28m9.263s
user    0m9.194s


The full log is available at
http://patchew.org/logs/address@hidden/testing.asan/?type=message.
---
Email generated automatically by Patchew [https://patchew.org/].
Please send your feedback to address@hidden

reply via email to

[Prev in Thread] Current Thread [Next in Thread]