qemu-devel
[Top][All Lists]
Advanced

[Date Prev][Date Next][Thread Prev][Thread Next][Date Index][Thread Index]

Re: [PATCH 0/2] thread: add lock guard macros


From: no-reply
Subject: Re: [PATCH 0/2] thread: add lock guard macros
Date: Wed, 11 Mar 2020 06:22:31 -0700 (PDT)

Patchew URL: https://patchew.org/QEMU/address@hidden/



Hi,

This series failed the docker-mingw@fedora build test. Please find the testing 
commands and
their output below. If you have Docker installed, you can probably reproduce it
locally.

=== TEST SCRIPT BEGIN ===
#! /bin/bash
export ARCH=x86_64
make docker-image-fedora V=1 NETWORK=1
time make docker-test-mingw@fedora J=14 NETWORK=1
=== TEST SCRIPT END ===

  CC      util/uri.o
  CC      util/notify.o
/tmp/qemu-test/src/util/qemu-timer.c: In function 'timerlist_expired':
/tmp/qemu-test/src/util/qemu-timer.c:196:24: error: 'expire_time' may be used 
uninitialized in this function [-Werror=maybe-uninitialized]
     return expire_time <= qemu_clock_get_ns(timer_list->clock->type);
            ~~~~~~~~~~~~^~~~~~~~~~~~~~~~~~~~~~~~~~~~~~~~~~~~~~~~~~~~~
cc1: all warnings being treated as errors
make: *** [/tmp/qemu-test/src/rules.mak:69: util/qemu-timer.o] Error 1
make: *** Waiting for unfinished jobs....
Traceback (most recent call last):
  File "./tests/docker/docker.py", line 664, in <module>
---
    raise CalledProcessError(retcode, cmd)
subprocess.CalledProcessError: Command '['sudo', '-n', 'docker', 'run', 
'--label', 'com.qemu.instance.uuid=bbe7ec3619e2401a97060d5d9ab55bac', '-u', 
'1003', '--security-opt', 'seccomp=unconfined', '--rm', '-e', 'TARGET_LIST=', 
'-e', 'EXTRA_CONFIGURE_OPTS=', '-e', 'V=', '-e', 'J=14', '-e', 'DEBUG=', '-e', 
'SHOW_ENV=', '-e', 'CCACHE_DIR=/var/tmp/ccache', '-v', 
'/home/patchew2/.cache/qemu-docker-ccache:/var/tmp/ccache:z', '-v', 
'/var/tmp/patchew-tester-tmp-jdtnwksa/src/docker-src.2020-03-11-09.20.54.2854:/var/tmp/qemu:z,ro',
 'qemu:fedora', '/var/tmp/qemu/run', 'test-mingw']' returned non-zero exit 
status 2.
filter=--filter=label=com.qemu.instance.uuid=bbe7ec3619e2401a97060d5d9ab55bac
make[1]: *** [docker-run] Error 1
make[1]: Leaving directory `/var/tmp/patchew-tester-tmp-jdtnwksa/src'
make: *** [docker-run-test-mingw@fedora] Error 2

real    1m36.654s
user    0m7.856s


The full log is available at
http://patchew.org/logs/address@hidden/testing.docker-mingw@fedora/?type=message.
---
Email generated automatically by Patchew [https://patchew.org/].
Please send your feedback to address@hidden

reply via email to

[Prev in Thread] Current Thread [Next in Thread]