qemu-devel
[Top][All Lists]
Advanced

[Date Prev][Date Next][Thread Prev][Thread Next][Date Index][Thread Index]

Re: [PATCH v8 00/18] Add Allwinner H3 SoC and Orange Pi PC Machine


From: no-reply
Subject: Re: [PATCH v8 00/18] Add Allwinner H3 SoC and Orange Pi PC Machine
Date: Wed, 11 Mar 2020 16:02:41 -0700 (PDT)

Patchew URL: https://patchew.org/QEMU/address@hidden/



Hi,

This series failed the asan build test. Please find the testing commands and
their output below. If you have Docker installed, you can probably reproduce it
locally.

=== TEST SCRIPT BEGIN ===
#!/bin/bash
export ARCH=x86_64
make docker-image-fedora V=1 NETWORK=1
time make docker-test-debug@fedora TARGET_LIST=x86_64-softmmu J=14 NETWORK=1
=== TEST SCRIPT END ===

PASS 1 fdc-test /x86_64/fdc/cmos
PASS 2 fdc-test /x86_64/fdc/no_media_on_start
PASS 3 fdc-test /x86_64/fdc/read_without_media
==6199==WARNING: ASan doesn't fully support makecontext/swapcontext functions 
and may produce false positives in some cases!
PASS 4 fdc-test /x86_64/fdc/media_change
PASS 5 fdc-test /x86_64/fdc/sense_interrupt
PASS 6 fdc-test /x86_64/fdc/relative_seek
---
PASS 32 test-opts-visitor /visitor/opts/range/beyond
PASS 33 test-opts-visitor /visitor/opts/dict/unvisited
MALLOC_PERTURB_=${MALLOC_PERTURB_:-$(( ${RANDOM:-0} % 255 + 1))}  
tests/test-coroutine -m=quick -k --tap < /dev/null | ./scripts/tap-driver.pl 
--test-name="test-coroutine" 
==6240==WARNING: ASan doesn't fully support makecontext/swapcontext functions 
and may produce false positives in some cases!
==6240==WARNING: ASan is ignoring requested __asan_handle_no_return: stack top: 
0x7ffc6ef02000; bottom 0x7f6fe8dc6000; size: 0x008c8613c000 (603544862720)
False positive error reports may follow
For details see https://github.com/google/sanitizers/issues/189
PASS 1 test-coroutine /basic/no-dangling-access
---
PASS 12 test-aio /aio/event/flush
PASS 13 test-aio /aio/event/wait/no-flush-cb
PASS 14 test-aio /aio/timer/schedule
==6255==WARNING: ASan doesn't fully support makecontext/swapcontext functions 
and may produce false positives in some cases!
PASS 15 test-aio /aio/coroutine/queue-chaining
PASS 16 test-aio /aio-gsource/flush
PASS 17 test-aio /aio-gsource/bh/schedule
---
PASS 12 fdc-test /x86_64/fdc/read_no_dma_19
PASS 13 fdc-test /x86_64/fdc/fuzz-registers
MALLOC_PERTURB_=${MALLOC_PERTURB_:-$(( ${RANDOM:-0} % 255 + 1))}  
QTEST_QEMU_BINARY=x86_64-softmmu/qemu-system-x86_64 QTEST_QEMU_IMG=qemu-img 
tests/qtest/ide-test -m=quick -k --tap < /dev/null | ./scripts/tap-driver.pl 
--test-name="ide-test" 
==6263==WARNING: ASan doesn't fully support makecontext/swapcontext functions 
and may produce false positives in some cases!
PASS 28 test-aio /aio-gsource/timer/schedule
PASS 1 ide-test /x86_64/ide/identify
MALLOC_PERTURB_=${MALLOC_PERTURB_:-$(( ${RANDOM:-0} % 255 + 1))}  
tests/test-aio-multithread -m=quick -k --tap < /dev/null | 
./scripts/tap-driver.pl --test-name="test-aio-multithread" 
==6272==WARNING: ASan doesn't fully support makecontext/swapcontext functions 
and may produce false positives in some cases!
PASS 1 test-aio-multithread /aio/multi/lifecycle
==6269==WARNING: ASan doesn't fully support makecontext/swapcontext functions 
and may produce false positives in some cases!
PASS 2 test-aio-multithread /aio/multi/schedule
PASS 3 test-aio-multithread /aio/multi/mutex/contended
PASS 2 ide-test /x86_64/ide/flush
PASS 4 test-aio-multithread /aio/multi/mutex/handoff
==6299==WARNING: ASan doesn't fully support makecontext/swapcontext functions 
and may produce false positives in some cases!
PASS 3 ide-test /x86_64/ide/bmdma/simple_rw
==6310==WARNING: ASan doesn't fully support makecontext/swapcontext functions 
and may produce false positives in some cases!
PASS 5 test-aio-multithread /aio/multi/mutex/mcs
PASS 4 ide-test /x86_64/ide/bmdma/trim
==6321==WARNING: ASan doesn't fully support makecontext/swapcontext functions 
and may produce false positives in some cases!
PASS 6 test-aio-multithread /aio/multi/mutex/pthread
MALLOC_PERTURB_=${MALLOC_PERTURB_:-$(( ${RANDOM:-0} % 255 + 1))}  
tests/test-throttle -m=quick -k --tap < /dev/null | ./scripts/tap-driver.pl 
--test-name="test-throttle" 
==6328==WARNING: ASan doesn't fully support makecontext/swapcontext functions 
and may produce false positives in some cases!
PASS 1 test-throttle /throttle/leak_bucket
PASS 2 test-throttle /throttle/compute_wait
PASS 3 test-throttle /throttle/init
---
PASS 14 test-throttle /throttle/config/max
PASS 15 test-throttle /throttle/config/iops_size
MALLOC_PERTURB_=${MALLOC_PERTURB_:-$(( ${RANDOM:-0} % 255 + 1))}  
tests/test-thread-pool -m=quick -k --tap < /dev/null | ./scripts/tap-driver.pl 
--test-name="test-thread-pool" 
==6332==WARNING: ASan doesn't fully support makecontext/swapcontext functions 
and may produce false positives in some cases!
PASS 1 test-thread-pool /thread-pool/submit
PASS 2 test-thread-pool /thread-pool/submit-aio
PASS 3 test-thread-pool /thread-pool/submit-co
---
PASS 2 test-hbitmap /hbitmap/size/0
PASS 3 test-hbitmap /hbitmap/size/unaligned
PASS 4 test-hbitmap /hbitmap/iter/empty
==6402==WARNING: ASan doesn't fully support makecontext/swapcontext functions 
and may produce false positives in some cases!
PASS 5 test-hbitmap /hbitmap/iter/partial
PASS 6 test-hbitmap /hbitmap/iter/granularity
PASS 7 test-hbitmap /hbitmap/iter/iter_and_reset
---
PASS 28 test-hbitmap /hbitmap/truncate/shrink/medium
PASS 29 test-hbitmap /hbitmap/truncate/shrink/large
PASS 30 test-hbitmap /hbitmap/meta/zero
==6409==WARNING: ASan doesn't fully support makecontext/swapcontext functions 
and may produce false positives in some cases!
PASS 31 test-hbitmap /hbitmap/meta/one
PASS 32 test-hbitmap /hbitmap/meta/byte
PASS 33 test-hbitmap /hbitmap/meta/word
---
PASS 44 test-hbitmap /hbitmap/next_dirty_area/next_dirty_area_4
PASS 45 test-hbitmap /hbitmap/next_dirty_area/next_dirty_area_after_truncate
MALLOC_PERTURB_=${MALLOC_PERTURB_:-$(( ${RANDOM:-0} % 255 + 1))}  
tests/test-bdrv-drain -m=quick -k --tap < /dev/null | ./scripts/tap-driver.pl 
--test-name="test-bdrv-drain" 
==6418==WARNING: ASan doesn't fully support makecontext/swapcontext functions 
and may produce false positives in some cases!
PASS 1 test-bdrv-drain /bdrv-drain/nested
PASS 2 test-bdrv-drain /bdrv-drain/multiparent
PASS 3 test-bdrv-drain /bdrv-drain/set_aio_context
---
PASS 23 test-bdrv-drain /bdrv-drain/blockjob/drain_subtree
PASS 24 test-bdrv-drain /bdrv-drain/blockjob/commit_by_drained_end
PASS 25 test-bdrv-drain /bdrv-drain/blockjob/error/drain_all
==6415==WARNING: ASan doesn't fully support makecontext/swapcontext functions 
and may produce false positives in some cases!
PASS 26 test-bdrv-drain /bdrv-drain/blockjob/error/drain
PASS 27 test-bdrv-drain /bdrv-drain/blockjob/error/drain_subtree
PASS 28 test-bdrv-drain /bdrv-drain/blockjob/iothread/drain_all
---
PASS 41 test-bdrv-drain /bdrv-drain/bdrv_drop_intermediate/poll
PASS 42 test-bdrv-drain /bdrv-drain/replace_child/mid-drain
MALLOC_PERTURB_=${MALLOC_PERTURB_:-$(( ${RANDOM:-0} % 255 + 1))}  
tests/test-bdrv-graph-mod -m=quick -k --tap < /dev/null | 
./scripts/tap-driver.pl --test-name="test-bdrv-graph-mod" 
==6461==WARNING: ASan doesn't fully support makecontext/swapcontext functions 
and may produce false positives in some cases!
PASS 1 test-bdrv-graph-mod /bdrv-graph-mod/update-perm-tree
PASS 2 test-bdrv-graph-mod /bdrv-graph-mod/should-update-child
MALLOC_PERTURB_=${MALLOC_PERTURB_:-$(( ${RANDOM:-0} % 255 + 1))}  
tests/test-blockjob -m=quick -k --tap < /dev/null | ./scripts/tap-driver.pl 
--test-name="test-blockjob" 
==6465==WARNING: ASan doesn't fully support makecontext/swapcontext functions 
and may produce false positives in some cases!
PASS 1 test-blockjob /blockjob/ids
PASS 2 test-blockjob /blockjob/cancel/created
PASS 3 test-blockjob /blockjob/cancel/running
---
PASS 7 test-blockjob /blockjob/cancel/pending
PASS 8 test-blockjob /blockjob/cancel/concluded
MALLOC_PERTURB_=${MALLOC_PERTURB_:-$(( ${RANDOM:-0} % 255 + 1))}  
tests/test-blockjob-txn -m=quick -k --tap < /dev/null | ./scripts/tap-driver.pl 
--test-name="test-blockjob-txn" 
==6469==WARNING: ASan doesn't fully support makecontext/swapcontext functions 
and may produce false positives in some cases!
PASS 1 test-blockjob-txn /single/success
PASS 2 test-blockjob-txn /single/failure
PASS 3 test-blockjob-txn /single/cancel
---
PASS 6 test-blockjob-txn /pair/cancel
PASS 7 test-blockjob-txn /pair/fail-cancel-race
MALLOC_PERTURB_=${MALLOC_PERTURB_:-$(( ${RANDOM:-0} % 255 + 1))}  
tests/test-block-backend -m=quick -k --tap < /dev/null | 
./scripts/tap-driver.pl --test-name="test-block-backend" 
==6473==WARNING: ASan doesn't fully support makecontext/swapcontext functions 
and may produce false positives in some cases!
PASS 1 test-block-backend /block-backend/drain_aio_error
PASS 2 test-block-backend /block-backend/drain_all_aio_error
MALLOC_PERTURB_=${MALLOC_PERTURB_:-$(( ${RANDOM:-0} % 255 + 1))}  
tests/test-block-iothread -m=quick -k --tap < /dev/null | 
./scripts/tap-driver.pl --test-name="test-block-iothread" 
==6477==WARNING: ASan doesn't fully support makecontext/swapcontext functions 
and may produce false positives in some cases!
PASS 1 test-block-iothread /sync-op/pread
PASS 2 test-block-iothread /sync-op/pwrite
PASS 3 test-block-iothread /sync-op/load_vmstate
---
PASS 15 test-block-iothread /propagate/diamond
PASS 16 test-block-iothread /propagate/mirror
MALLOC_PERTURB_=${MALLOC_PERTURB_:-$(( ${RANDOM:-0} % 255 + 1))}  
tests/test-image-locking -m=quick -k --tap < /dev/null | 
./scripts/tap-driver.pl --test-name="test-image-locking" 
==6497==WARNING: ASan doesn't fully support makecontext/swapcontext functions 
and may produce false positives in some cases!
PASS 1 test-image-locking /image-locking/basic
PASS 2 test-image-locking /image-locking/set-perm-abort
MALLOC_PERTURB_=${MALLOC_PERTURB_:-$(( ${RANDOM:-0} % 255 + 1))}  
tests/test-x86-cpuid -m=quick -k --tap < /dev/null | ./scripts/tap-driver.pl 
--test-name="test-x86-cpuid" 
---
PASS 9 test-int128 /int128/int128_gt
PASS 10 test-int128 /int128/int128_rshift
MALLOC_PERTURB_=${MALLOC_PERTURB_:-$(( ${RANDOM:-0} % 255 + 1))}  
tests/rcutorture -m=quick -k --tap < /dev/null | ./scripts/tap-driver.pl 
--test-name="rcutorture" 
==6533==WARNING: ASan doesn't fully support makecontext/swapcontext functions 
and may produce false positives in some cases!
PASS 1 rcutorture /rcu/torture/1reader
PASS 2 rcutorture /rcu/torture/10readers
MALLOC_PERTURB_=${MALLOC_PERTURB_:-$(( ${RANDOM:-0} % 255 + 1))}  
tests/test-rcu-list -m=quick -k --tap < /dev/null | ./scripts/tap-driver.pl 
--test-name="test-rcu-list" 
PASS 1 test-rcu-list /rcu/qlist/single-threaded
PASS 2 test-rcu-list /rcu/qlist/short-few
==6588==WARNING: ASan doesn't fully support makecontext/swapcontext functions 
and may produce false positives in some cases!
PASS 3 test-rcu-list /rcu/qlist/long-many
MALLOC_PERTURB_=${MALLOC_PERTURB_:-$(( ${RANDOM:-0} % 255 + 1))}  
tests/test-rcu-simpleq -m=quick -k --tap < /dev/null | ./scripts/tap-driver.pl 
--test-name="test-rcu-simpleq" 
PASS 1 test-rcu-simpleq /rcu/qsimpleq/single-threaded
---
PASS 3 test-rcu-simpleq /rcu/qsimpleq/long-many
MALLOC_PERTURB_=${MALLOC_PERTURB_:-$(( ${RANDOM:-0} % 255 + 1))}  
tests/test-rcu-tailq -m=quick -k --tap < /dev/null | ./scripts/tap-driver.pl 
--test-name="test-rcu-tailq" 
PASS 1 test-rcu-tailq /rcu/qtailq/single-threaded
==6633==WARNING: ASan doesn't fully support makecontext/swapcontext functions 
and may produce false positives in some cases!
PASS 2 test-rcu-tailq /rcu/qtailq/short-few
PASS 3 test-rcu-tailq /rcu/qtailq/long-many
MALLOC_PERTURB_=${MALLOC_PERTURB_:-$(( ${RANDOM:-0} % 255 + 1))}  
tests/test-rcu-slist -m=quick -k --tap < /dev/null | ./scripts/tap-driver.pl 
--test-name="test-rcu-slist" 
PASS 1 test-rcu-slist /rcu/qslist/single-threaded
PASS 2 test-rcu-slist /rcu/qslist/short-few
==6678==WARNING: ASan doesn't fully support makecontext/swapcontext functions 
and may produce false positives in some cases!
PASS 3 test-rcu-slist /rcu/qslist/long-many
MALLOC_PERTURB_=${MALLOC_PERTURB_:-$(( ${RANDOM:-0} % 255 + 1))}  
tests/test-qdist -m=quick -k --tap < /dev/null | ./scripts/tap-driver.pl 
--test-name="test-qdist" 
PASS 1 test-qdist /qdist/none
---
PASS 7 test-qdist /qdist/binning/expand
PASS 8 test-qdist /qdist/binning/shrink
MALLOC_PERTURB_=${MALLOC_PERTURB_:-$(( ${RANDOM:-0} % 255 + 1))}  
tests/test-qht -m=quick -k --tap < /dev/null | ./scripts/tap-driver.pl 
--test-name="test-qht" 
==6712==WARNING: ASan doesn't fully support makecontext/swapcontext functions 
and may produce false positives in some cases!
PASS 5 ide-test /x86_64/ide/bmdma/various_prdts
==6718==WARNING: ASan doesn't fully support makecontext/swapcontext functions 
and may produce false positives in some cases!
==6718==WARNING: ASan is ignoring requested __asan_handle_no_return: stack top: 
0x7ffe9ebf0000; bottom 0x7fd21cd76000; size: 0x002c81e7a000 (191158001664)
False positive error reports may follow
For details see https://github.com/google/sanitizers/issues/189
PASS 6 ide-test /x86_64/ide/bmdma/no_busmaster
PASS 7 ide-test /x86_64/ide/flush/nodev
==6729==WARNING: ASan doesn't fully support makecontext/swapcontext functions 
and may produce false positives in some cases!
PASS 8 ide-test /x86_64/ide/flush/empty_drive
==6734==WARNING: ASan doesn't fully support makecontext/swapcontext functions 
and may produce false positives in some cases!
PASS 9 ide-test /x86_64/ide/flush/retry_pci
==6740==WARNING: ASan doesn't fully support makecontext/swapcontext functions 
and may produce false positives in some cases!
PASS 10 ide-test /x86_64/ide/flush/retry_isa
==6746==WARNING: ASan doesn't fully support makecontext/swapcontext functions 
and may produce false positives in some cases!
PASS 11 ide-test /x86_64/ide/cdrom/pio
==6752==WARNING: ASan doesn't fully support makecontext/swapcontext functions 
and may produce false positives in some cases!
PASS 1 test-qht /qht/mode/default
PASS 2 test-qht /qht/mode/resize
MALLOC_PERTURB_=${MALLOC_PERTURB_:-$(( ${RANDOM:-0} % 255 + 1))}  
tests/test-qht-par -m=quick -k --tap < /dev/null | ./scripts/tap-driver.pl 
--test-name="test-qht-par" 
PASS 12 ide-test /x86_64/ide/cdrom/pio_large
PASS 1 test-qht-par /qht/parallel/2threads-0%updates-1s
==6767==WARNING: ASan doesn't fully support makecontext/swapcontext functions 
and may produce false positives in some cases!
PASS 13 ide-test /x86_64/ide/cdrom/dma
MALLOC_PERTURB_=${MALLOC_PERTURB_:-$(( ${RANDOM:-0} % 255 + 1))}  
QTEST_QEMU_BINARY=x86_64-softmmu/qemu-system-x86_64 QTEST_QEMU_IMG=qemu-img 
tests/qtest/ahci-test -m=quick -k --tap < /dev/null | ./scripts/tap-driver.pl 
--test-name="ahci-test" 
==6787==WARNING: ASan doesn't fully support makecontext/swapcontext functions 
and may produce false positives in some cases!
PASS 2 test-qht-par /qht/parallel/2threads-20%updates-1s
MALLOC_PERTURB_=${MALLOC_PERTURB_:-$(( ${RANDOM:-0} % 255 + 1))}  
tests/test-bitops -m=quick -k --tap < /dev/null | ./scripts/tap-driver.pl 
--test-name="test-bitops" 
PASS 1 test-bitops /bitops/sextract32
---
PASS 3 test-qdev-global-props /qdev/properties/dynamic/global
PASS 4 test-qdev-global-props /qdev/properties/global/subclass
MALLOC_PERTURB_=${MALLOC_PERTURB_:-$(( ${RANDOM:-0} % 255 + 1))}  
tests/check-qom-interface -m=quick -k --tap < /dev/null | 
./scripts/tap-driver.pl --test-name="check-qom-interface" 
==6806==WARNING: ASan doesn't fully support makecontext/swapcontext functions 
and may produce false positives in some cases!
PASS 1 check-qom-interface /qom/interface/direct_impl
PASS 2 check-qom-interface /qom/interface/intermediate_impl
MALLOC_PERTURB_=${MALLOC_PERTURB_:-$(( ${RANDOM:-0} % 255 + 1))}  
tests/check-qom-proplist -m=quick -k --tap < /dev/null | 
./scripts/tap-driver.pl --test-name="check-qom-proplist" 
---
PASS 18 test-qemu-opts /qemu-opts/to_qdict/filtered
PASS 19 test-qemu-opts /qemu-opts/to_qdict/duplicates
MALLOC_PERTURB_=${MALLOC_PERTURB_:-$(( ${RANDOM:-0} % 255 + 1))}  
tests/test-keyval -m=quick -k --tap < /dev/null | ./scripts/tap-driver.pl 
--test-name="test-keyval" 
==6827==WARNING: ASan doesn't fully support makecontext/swapcontext functions 
and may produce false positives in some cases!
PASS 1 test-keyval /keyval/keyval_parse
PASS 2 test-keyval /keyval/keyval_parse/list
PASS 3 test-keyval /keyval/visit/bool
---
PASS 4 test-crypto-hash /crypto/hash/digest
PASS 5 test-crypto-hash /crypto/hash/base64
MALLOC_PERTURB_=${MALLOC_PERTURB_:-$(( ${RANDOM:-0} % 255 + 1))}  
tests/test-crypto-hmac -m=quick -k --tap < /dev/null | ./scripts/tap-driver.pl 
--test-name="test-crypto-hmac" 
==6844==WARNING: ASan doesn't fully support makecontext/swapcontext functions 
and may produce false positives in some cases!
PASS 1 test-crypto-hmac /crypto/hmac/iov
PASS 2 test-crypto-hmac /crypto/hmac/alloc
PASS 3 test-crypto-hmac /crypto/hmac/prealloc
---
PASS 15 test-crypto-secret /crypto/secret/crypt/missingiv
PASS 16 test-crypto-secret /crypto/secret/crypt/badiv
MALLOC_PERTURB_=${MALLOC_PERTURB_:-$(( ${RANDOM:-0} % 255 + 1))}  
tests/test-crypto-tlscredsx509 -m=quick -k --tap < /dev/null | 
./scripts/tap-driver.pl --test-name="test-crypto-tlscredsx509" 
==6863==WARNING: ASan doesn't fully support makecontext/swapcontext functions 
and may produce false positives in some cases!
PASS 5 ahci-test /x86_64/ahci/hba_enable
==6877==WARNING: ASan doesn't fully support makecontext/swapcontext functions 
and may produce false positives in some cases!
PASS 6 ahci-test /x86_64/ahci/identify
==6883==WARNING: ASan doesn't fully support makecontext/swapcontext functions 
and may produce false positives in some cases!
PASS 7 ahci-test /x86_64/ahci/max
==6889==WARNING: ASan doesn't fully support makecontext/swapcontext functions 
and may produce false positives in some cases!
PASS 8 ahci-test /x86_64/ahci/reset
PASS 1 test-crypto-tlscredsx509 /qcrypto/tlscredsx509/perfectserver
PASS 2 test-crypto-tlscredsx509 /qcrypto/tlscredsx509/perfectclient
==6895==WARNING: ASan doesn't fully support makecontext/swapcontext functions 
and may produce false positives in some cases!
==6895==WARNING: ASan is ignoring requested __asan_handle_no_return: stack top: 
0x7fff8172f000; bottom 0x7f0c1fdfe000; size: 0x00f361931000 (1045314080768)
False positive error reports may follow
For details see https://github.com/google/sanitizers/issues/189
PASS 3 test-crypto-tlscredsx509 /qcrypto/tlscredsx509/goodca1
PASS 9 ahci-test /x86_64/ahci/io/pio/lba28/simple/zero
==6901==WARNING: ASan doesn't fully support makecontext/swapcontext functions 
and may produce false positives in some cases!
==6901==WARNING: ASan is ignoring requested __asan_handle_no_return: stack top: 
0x7ffed5572000; bottom 0x7f8b841fe000; size: 0x007351374000 (495283814400)
False positive error reports may follow
For details see https://github.com/google/sanitizers/issues/189
PASS 10 ahci-test /x86_64/ahci/io/pio/lba28/simple/low
==6907==WARNING: ASan doesn't fully support makecontext/swapcontext functions 
and may produce false positives in some cases!
PASS 4 test-crypto-tlscredsx509 /qcrypto/tlscredsx509/goodca2
==6907==WARNING: ASan is ignoring requested __asan_handle_no_return: stack top: 
0x7fff63b11000; bottom 0x7f9cf1ffe000; size: 0x006271b13000 (422814232576)
False positive error reports may follow
For details see https://github.com/google/sanitizers/issues/189
PASS 11 ahci-test /x86_64/ahci/io/pio/lba28/simple/high
==6913==WARNING: ASan doesn't fully support makecontext/swapcontext functions 
and may produce false positives in some cases!
PASS 5 test-crypto-tlscredsx509 /qcrypto/tlscredsx509/goodca3
PASS 6 test-crypto-tlscredsx509 /qcrypto/tlscredsx509/badca1
PASS 7 test-crypto-tlscredsx509 /qcrypto/tlscredsx509/badca2
PASS 8 test-crypto-tlscredsx509 /qcrypto/tlscredsx509/badca3
PASS 9 test-crypto-tlscredsx509 /qcrypto/tlscredsx509/goodserver1
==6913==WARNING: ASan is ignoring requested __asan_handle_no_return: stack top: 
0x7ffd4e5ce000; bottom 0x7f8fa1dfe000; size: 0x006dac7d0000 (471045308416)
False positive error reports may follow
For details see https://github.com/google/sanitizers/issues/189
PASS 12 ahci-test /x86_64/ahci/io/pio/lba28/double/zero
PASS 10 test-crypto-tlscredsx509 /qcrypto/tlscredsx509/goodserver2
==6919==WARNING: ASan doesn't fully support makecontext/swapcontext functions 
and may produce false positives in some cases!
==6919==WARNING: ASan is ignoring requested __asan_handle_no_return: stack top: 
0x7ffe88f2d000; bottom 0x7f461f1fe000; size: 0x00b869d2f000 (792049414144)
False positive error reports may follow
For details see https://github.com/google/sanitizers/issues/189
PASS 13 ahci-test /x86_64/ahci/io/pio/lba28/double/low
==6925==WARNING: ASan doesn't fully support makecontext/swapcontext functions 
and may produce false positives in some cases!
==6925==WARNING: ASan is ignoring requested __asan_handle_no_return: stack top: 
0x7ffd5cdb2000; bottom 0x7fc0c59fe000; size: 0x003c973b4000 (260235280384)
False positive error reports may follow
For details see https://github.com/google/sanitizers/issues/189
PASS 11 test-crypto-tlscredsx509 /qcrypto/tlscredsx509/goodserver3
PASS 14 ahci-test /x86_64/ahci/io/pio/lba28/double/high
==6931==WARNING: ASan doesn't fully support makecontext/swapcontext functions 
and may produce false positives in some cases!
==6931==WARNING: ASan is ignoring requested __asan_handle_no_return: stack top: 
0x7ffd09dbe000; bottom 0x7f904fffe000; size: 0x006cb9dc0000 (466974670848)
False positive error reports may follow
For details see https://github.com/google/sanitizers/issues/189
PASS 12 test-crypto-tlscredsx509 /qcrypto/tlscredsx509/goodserver4
PASS 15 ahci-test /x86_64/ahci/io/pio/lba28/long/zero
PASS 13 test-crypto-tlscredsx509 /qcrypto/tlscredsx509/goodserver5
==6937==WARNING: ASan doesn't fully support makecontext/swapcontext functions 
and may produce false positives in some cases!
==6937==WARNING: ASan is ignoring requested __asan_handle_no_return: stack top: 
0x7fff1a625000; bottom 0x7f3f8977c000; size: 0x00bf90ea9000 (822770044928)
False positive error reports may follow
For details see https://github.com/google/sanitizers/issues/189
PASS 14 test-crypto-tlscredsx509 /qcrypto/tlscredsx509/goodserver6
---
PASS 38 test-crypto-tlscredsx509 /qcrypto/tlscredsx509/missingserver
PASS 39 test-crypto-tlscredsx509 /qcrypto/tlscredsx509/missingclient
MALLOC_PERTURB_=${MALLOC_PERTURB_:-$(( ${RANDOM:-0} % 255 + 1))}  
tests/test-crypto-tlssession -m=quick -k --tap < /dev/null | 
./scripts/tap-driver.pl --test-name="test-crypto-tlssession" 
==6943==WARNING: ASan doesn't fully support makecontext/swapcontext functions 
and may produce false positives in some cases!
==6943==WARNING: ASan is ignoring requested __asan_handle_no_return: stack top: 
0x7ffe3f6ad000; bottom 0x7f68b9dfe000; size: 0x0095858af000 (642190602240)
False positive error reports may follow
For details see https://github.com/google/sanitizers/issues/189
PASS 1 test-crypto-tlssession /qcrypto/tlssession/psk
PASS 17 ahci-test /x86_64/ahci/io/pio/lba28/long/high
PASS 2 test-crypto-tlssession /qcrypto/tlssession/basicca
==6953==WARNING: ASan doesn't fully support makecontext/swapcontext functions 
and may produce false positives in some cases!
PASS 3 test-crypto-tlssession /qcrypto/tlssession/differentca
PASS 4 test-crypto-tlssession /qcrypto/tlssession/altname1
PASS 18 ahci-test /x86_64/ahci/io/pio/lba28/short/zero
PASS 5 test-crypto-tlssession /qcrypto/tlssession/altname2
==6959==WARNING: ASan doesn't fully support makecontext/swapcontext functions 
and may produce false positives in some cases!
PASS 6 test-crypto-tlssession /qcrypto/tlssession/altname3
PASS 19 ahci-test /x86_64/ahci/io/pio/lba28/short/low
PASS 7 test-crypto-tlssession /qcrypto/tlssession/altname4
==6965==WARNING: ASan doesn't fully support makecontext/swapcontext functions 
and may produce false positives in some cases!
PASS 8 test-crypto-tlssession /qcrypto/tlssession/altname5
PASS 20 ahci-test /x86_64/ahci/io/pio/lba28/short/high
==6971==WARNING: ASan doesn't fully support makecontext/swapcontext functions 
and may produce false positives in some cases!
PASS 9 test-crypto-tlssession /qcrypto/tlssession/altname6
==6971==WARNING: ASan is ignoring requested __asan_handle_no_return: stack top: 
0x7ffc24b9f000; bottom 0x7f1552ffe000; size: 0x00e6d1ba1000 (991361110016)
False positive error reports may follow
For details see https://github.com/google/sanitizers/issues/189
PASS 21 ahci-test /x86_64/ahci/io/pio/lba48/simple/zero
PASS 10 test-crypto-tlssession /qcrypto/tlssession/wildcard1
==6977==WARNING: ASan doesn't fully support makecontext/swapcontext functions 
and may produce false positives in some cases!
==6977==WARNING: ASan is ignoring requested __asan_handle_no_return: stack top: 
0x7ffd5a777000; bottom 0x7fe086ffe000; size: 0x001cd3779000 (123806912512)
False positive error reports may follow
For details see https://github.com/google/sanitizers/issues/189
PASS 22 ahci-test /x86_64/ahci/io/pio/lba48/simple/low
PASS 11 test-crypto-tlssession /qcrypto/tlssession/wildcard2
==6983==WARNING: ASan doesn't fully support makecontext/swapcontext functions 
and may produce false positives in some cases!
PASS 12 test-crypto-tlssession /qcrypto/tlssession/wildcard3
==6983==WARNING: ASan is ignoring requested __asan_handle_no_return: stack top: 
0x7ffd768a1000; bottom 0x7f895d1fe000; size: 0x0074196a3000 (498642595840)
False positive error reports may follow
For details see https://github.com/google/sanitizers/issues/189
PASS 23 ahci-test /x86_64/ahci/io/pio/lba48/simple/high
PASS 13 test-crypto-tlssession /qcrypto/tlssession/wildcard4
PASS 14 test-crypto-tlssession /qcrypto/tlssession/wildcard5
==6989==WARNING: ASan doesn't fully support makecontext/swapcontext functions 
and may produce false positives in some cases!
PASS 15 test-crypto-tlssession /qcrypto/tlssession/wildcard6
==6989==WARNING: ASan is ignoring requested __asan_handle_no_return: stack top: 
0x7ffd9d854000; bottom 0x7f9a665fe000; size: 0x006337256000 (426126958592)
False positive error reports may follow
For details see https://github.com/google/sanitizers/issues/189
PASS 24 ahci-test /x86_64/ahci/io/pio/lba48/double/zero
PASS 16 test-crypto-tlssession /qcrypto/tlssession/cachain
MALLOC_PERTURB_=${MALLOC_PERTURB_:-$(( ${RANDOM:-0} % 255 + 1))}  
tests/test-qga -m=quick -k --tap < /dev/null | ./scripts/tap-driver.pl 
--test-name="test-qga" 
==6995==WARNING: ASan doesn't fully support makecontext/swapcontext functions 
and may produce false positives in some cases!
==6995==WARNING: ASan is ignoring requested __asan_handle_no_return: stack top: 
0x7ffe9ff31000; bottom 0x7fae30ffe000; size: 0x00506ef33000 (345458814976)
False positive error reports may follow
For details see https://github.com/google/sanitizers/issues/189
PASS 25 ahci-test /x86_64/ahci/io/pio/lba48/double/low
---
PASS 4 test-qga /qga/info
PASS 5 test-qga /qga/network-get-interfaces
PASS 6 test-qga /qga/get-vcpus
==7009==WARNING: ASan doesn't fully support makecontext/swapcontext functions 
and may produce false positives in some cases!
PASS 7 test-qga /qga/get-fsinfo
PASS 8 test-qga /qga/get-memory-block-info
PASS 9 test-qga /qga/get-memory-blocks
---
PASS 15 test-qga /qga/invalid-cmd
PASS 16 test-qga /qga/invalid-args
PASS 17 test-qga /qga/fsfreeze-status
==7009==WARNING: ASan is ignoring requested __asan_handle_no_return: stack top: 
0x7ffc453e6000; bottom 0x7fb117dfe000; size: 0x004b2d5e8000 (322883715072)
False positive error reports may follow
For details see https://github.com/google/sanitizers/issues/189
PASS 26 ahci-test /x86_64/ahci/io/pio/lba48/double/high
==7018==WARNING: ASan doesn't fully support makecontext/swapcontext functions 
and may produce false positives in some cases!
==7018==WARNING: ASan is ignoring requested __asan_handle_no_return: stack top: 
0x7ffe71c13000; bottom 0x7f59491fe000; size: 0x00a528a15000 (709351264256)
False positive error reports may follow
For details see https://github.com/google/sanitizers/issues/189
PASS 18 test-qga /qga/blacklist
---
PASS 20 test-qga /qga/guest-exec
PASS 21 test-qga /qga/guest-exec-invalid
PASS 27 ahci-test /x86_64/ahci/io/pio/lba48/long/zero
==7036==WARNING: ASan doesn't fully support makecontext/swapcontext functions 
and may produce false positives in some cases!
==7036==WARNING: ASan is ignoring requested __asan_handle_no_return: stack top: 
0x7ffdd6ccf000; bottom 0x7f8161dfe000; size: 0x007c74ed1000 (534537637888)
False positive error reports may follow
For details see https://github.com/google/sanitizers/issues/189
PASS 22 test-qga /qga/guest-get-osinfo
---
MALLOC_PERTURB_=${MALLOC_PERTURB_:-$(( ${RANDOM:-0} % 255 + 1))}  
tests/test-authz-simple -m=quick -k --tap < /dev/null | ./scripts/tap-driver.pl 
--test-name="test-authz-simple" 
PASS 1 test-authz-simple /authz/simple
MALLOC_PERTURB_=${MALLOC_PERTURB_:-$(( ${RANDOM:-0} % 255 + 1))}  
tests/test-authz-list -m=quick -k --tap < /dev/null | ./scripts/tap-driver.pl 
--test-name="test-authz-list" 
==7052==WARNING: ASan doesn't fully support makecontext/swapcontext functions 
and may produce false positives in some cases!
PASS 1 test-authz-list /auth/list/complex
PASS 2 test-authz-list /auth/list/add-remove
PASS 3 test-authz-list /auth/list/default/deny
---
PASS 5 test-authz-list /auth/list/explicit/deny
PASS 6 test-authz-list /auth/list/explicit/allow
MALLOC_PERTURB_=${MALLOC_PERTURB_:-$(( ${RANDOM:-0} % 255 + 1))}  
tests/test-authz-listfile -m=quick -k --tap < /dev/null | 
./scripts/tap-driver.pl --test-name="test-authz-listfile" 
==7052==WARNING: ASan is ignoring requested __asan_handle_no_return: stack top: 
0x7ffc3d58b000; bottom 0x7f151e5fe000; size: 0x00e71ef8d000 (992657068032)
False positive error reports may follow
For details see https://github.com/google/sanitizers/issues/189
PASS 1 test-authz-listfile /auth/list/complex
---
PASS 4 test-io-channel-file /io/channel/pipe/sync
PASS 5 test-io-channel-file /io/channel/pipe/async
MALLOC_PERTURB_=${MALLOC_PERTURB_:-$(( ${RANDOM:-0} % 255 + 1))}  
tests/test-io-channel-tls -m=quick -k --tap < /dev/null | 
./scripts/tap-driver.pl --test-name="test-io-channel-tls" 
==7084==WARNING: ASan doesn't fully support makecontext/swapcontext functions 
and may produce false positives in some cases!
PASS 30 ahci-test /x86_64/ahci/io/pio/lba48/short/zero
PASS 1 test-io-channel-tls /qio/channel/tls/basic
MALLOC_PERTURB_=${MALLOC_PERTURB_:-$(( ${RANDOM:-0} % 255 + 1))}  
tests/test-io-channel-command -m=quick -k --tap < /dev/null | 
./scripts/tap-driver.pl --test-name="test-io-channel-command" 
==7138==WARNING: ASan doesn't fully support makecontext/swapcontext functions 
and may produce false positives in some cases!
PASS 1 test-io-channel-command /io/channel/command/fifo/sync
PASS 2 test-io-channel-command /io/channel/command/fifo/async
PASS 3 test-io-channel-command /io/channel/command/echo/sync
---
PASS 3 test-base64 /util/base64/not-nul-terminated
PASS 4 test-base64 /util/base64/invalid-chars
MALLOC_PERTURB_=${MALLOC_PERTURB_:-$(( ${RANDOM:-0} % 255 + 1))}  
tests/test-crypto-pbkdf -m=quick -k --tap < /dev/null | ./scripts/tap-driver.pl 
--test-name="test-crypto-pbkdf" 
==7159==WARNING: ASan doesn't fully support makecontext/swapcontext functions 
and may produce false positives in some cases!
PASS 1 test-crypto-pbkdf /crypto/pbkdf/rfc3962/sha1/iter1
PASS 2 test-crypto-pbkdf /crypto/pbkdf/rfc3962/sha1/iter2
PASS 3 test-crypto-pbkdf /crypto/pbkdf/rfc3962/sha1/iter1200a
---
PASS 16 test-crypto-xts /crypto/xts/t-15-key-32-ptx-25/unaligned
PASS 17 test-crypto-xts /crypto/xts/t-21-key-32-ptx-31/basic
PASS 18 test-crypto-xts /crypto/xts/t-21-key-32-ptx-31/unaligned
==7173==WARNING: ASan doesn't fully support makecontext/swapcontext functions 
and may produce false positives in some cases!
MALLOC_PERTURB_=${MALLOC_PERTURB_:-$(( ${RANDOM:-0} % 255 + 1))}  
tests/test-crypto-block -m=quick -k --tap < /dev/null | ./scripts/tap-driver.pl 
--test-name="test-crypto-block" 
PASS 1 test-crypto-block /crypto/block/qcow
MALLOC_PERTURB_=${MALLOC_PERTURB_:-$(( ${RANDOM:-0} % 255 + 1))}  
tests/test-logging -m=quick -k --tap < /dev/null | ./scripts/tap-driver.pl 
--test-name="test-logging" 
---
PASS 3 test-logging /logging/logfile_write_path
PASS 4 test-logging /logging/logfile_lock_path
MALLOC_PERTURB_=${MALLOC_PERTURB_:-$(( ${RANDOM:-0} % 255 + 1))}  
tests/test-replication -m=quick -k --tap < /dev/null | ./scripts/tap-driver.pl 
--test-name="test-replication" 
==7198==WARNING: ASan doesn't fully support makecontext/swapcontext functions 
and may produce false positives in some cases!
==7195==WARNING: ASan doesn't fully support makecontext/swapcontext functions 
and may produce false positives in some cases!
PASS 1 test-replication /replication/primary/read
PASS 34 ahci-test /x86_64/ahci/io/dma/lba28/retry
PASS 2 test-replication /replication/primary/write
==7206==WARNING: ASan doesn't fully support makecontext/swapcontext functions 
and may produce false positives in some cases!
PASS 3 test-replication /replication/primary/start
PASS 4 test-replication /replication/primary/stop
PASS 5 test-replication /replication/primary/do_checkpoint
PASS 6 test-replication /replication/primary/get_error_all
PASS 35 ahci-test /x86_64/ahci/io/dma/lba28/simple/zero
==7212==WARNING: ASan doesn't fully support makecontext/swapcontext functions 
and may produce false positives in some cases!
PASS 36 ahci-test /x86_64/ahci/io/dma/lba28/simple/low
==7218==WARNING: ASan doesn't fully support makecontext/swapcontext functions 
and may produce false positives in some cases!
PASS 37 ahci-test /x86_64/ahci/io/dma/lba28/simple/high
PASS 7 test-replication /replication/secondary/read
==7224==WARNING: ASan doesn't fully support makecontext/swapcontext functions 
and may produce false positives in some cases!
PASS 8 test-replication /replication/secondary/write
PASS 38 ahci-test /x86_64/ahci/io/dma/lba28/double/zero
==7230==WARNING: ASan doesn't fully support makecontext/swapcontext functions 
and may produce false positives in some cases!
PASS 39 ahci-test /x86_64/ahci/io/dma/lba28/double/low
==7236==WARNING: ASan doesn't fully support makecontext/swapcontext functions 
and may produce false positives in some cases!
PASS 40 ahci-test /x86_64/ahci/io/dma/lba28/double/high
==7243==WARNING: ASan doesn't fully support makecontext/swapcontext functions 
and may produce false positives in some cases!
==7243==WARNING: ASan is ignoring requested __asan_handle_no_return: stack top: 
0x7fffa2d08000; bottom 0x7f270ddfd000; size: 0x00d894f0b000 (930211737600)
False positive error reports may follow
For details see https://github.com/google/sanitizers/issues/189
==7198==WARNING: ASan is ignoring requested __asan_handle_no_return: stack top: 
0x7ffc8f9da000; bottom 0x7fc53ef34000; size: 0x003750aa6000 (237576544256)
False positive error reports may follow
For details see https://github.com/google/sanitizers/issues/189
PASS 41 ahci-test /x86_64/ahci/io/dma/lba28/long/zero
==7267==WARNING: ASan doesn't fully support makecontext/swapcontext functions 
and may produce false positives in some cases!
PASS 9 test-replication /replication/secondary/start
==7267==WARNING: ASan is ignoring requested __asan_handle_no_return: stack top: 
0x7ffd2278b000; bottom 0x7f75e617b000; size: 0x00873c610000 (580833574912)
False positive error reports may follow
For details see https://github.com/google/sanitizers/issues/189
PASS 42 ahci-test /x86_64/ahci/io/dma/lba28/long/low
==7274==WARNING: ASan doesn't fully support makecontext/swapcontext functions 
and may produce false positives in some cases!
==7274==WARNING: ASan is ignoring requested __asan_handle_no_return: stack top: 
0x7ffcb5e81000; bottom 0x7f340297b000; size: 0x00c8b3506000 (862001848320)
False positive error reports may follow
For details see https://github.com/google/sanitizers/issues/189
PASS 43 ahci-test /x86_64/ahci/io/dma/lba28/long/high
==7281==WARNING: ASan doesn't fully support makecontext/swapcontext functions 
and may produce false positives in some cases!
PASS 44 ahci-test /x86_64/ahci/io/dma/lba28/short/zero
==7287==WARNING: ASan doesn't fully support makecontext/swapcontext functions 
and may produce false positives in some cases!
PASS 10 test-replication /replication/secondary/stop
PASS 45 ahci-test /x86_64/ahci/io/dma/lba28/short/low
==7293==WARNING: ASan doesn't fully support makecontext/swapcontext functions 
and may produce false positives in some cases!
PASS 46 ahci-test /x86_64/ahci/io/dma/lba28/short/high
==7299==WARNING: ASan doesn't fully support makecontext/swapcontext functions 
and may produce false positives in some cases!
PASS 47 ahci-test /x86_64/ahci/io/dma/lba48/simple/zero
==7305==WARNING: ASan doesn't fully support makecontext/swapcontext functions 
and may produce false positives in some cases!
PASS 48 ahci-test /x86_64/ahci/io/dma/lba48/simple/low
PASS 11 test-replication /replication/secondary/continuous_replication
==7311==WARNING: ASan doesn't fully support makecontext/swapcontext functions 
and may produce false positives in some cases!
PASS 49 ahci-test /x86_64/ahci/io/dma/lba48/simple/high
==7317==WARNING: ASan doesn't fully support makecontext/swapcontext functions 
and may produce false positives in some cases!
PASS 50 ahci-test /x86_64/ahci/io/dma/lba48/double/zero
==7323==WARNING: ASan doesn't fully support makecontext/swapcontext functions 
and may produce false positives in some cases!
PASS 51 ahci-test /x86_64/ahci/io/dma/lba48/double/low
==7329==WARNING: ASan doesn't fully support makecontext/swapcontext functions 
and may produce false positives in some cases!
PASS 12 test-replication /replication/secondary/do_checkpoint
PASS 52 ahci-test /x86_64/ahci/io/dma/lba48/double/high
==7335==WARNING: ASan doesn't fully support makecontext/swapcontext functions 
and may produce false positives in some cases!
==7335==WARNING: ASan is ignoring requested __asan_handle_no_return: stack top: 
0x7ffe22558000; bottom 0x7f17f8f7b000; size: 0x00e6295dd000 (988536492032)
False positive error reports may follow
For details see https://github.com/google/sanitizers/issues/189
PASS 13 test-replication /replication/secondary/get_error_all
PASS 53 ahci-test /x86_64/ahci/io/dma/lba48/long/zero
MALLOC_PERTURB_=${MALLOC_PERTURB_:-$(( ${RANDOM:-0} % 255 + 1))}  
tests/test-bufferiszero -m=quick -k --tap < /dev/null | ./scripts/tap-driver.pl 
--test-name="test-bufferiszero" 
==7342==WARNING: ASan doesn't fully support makecontext/swapcontext functions 
and may produce false positives in some cases!
==7342==WARNING: ASan is ignoring requested __asan_handle_no_return: stack top: 
0x7fff99979000; bottom 0x7f12fddfd000; size: 0x00ec9bb7c000 (1016224792576)
False positive error reports may follow
For details see https://github.com/google/sanitizers/issues/189
PASS 54 ahci-test /x86_64/ahci/io/dma/lba48/long/low
==7352==WARNING: ASan doesn't fully support makecontext/swapcontext functions 
and may produce false positives in some cases!
==7352==WARNING: ASan is ignoring requested __asan_handle_no_return: stack top: 
0x7ffd9e5cc000; bottom 0x7f8022d23000; size: 0x007d7b8a9000 (538943590400)
False positive error reports may follow
For details see https://github.com/google/sanitizers/issues/189
PASS 55 ahci-test /x86_64/ahci/io/dma/lba48/long/high
==7359==WARNING: ASan doesn't fully support makecontext/swapcontext functions 
and may produce false positives in some cases!
PASS 56 ahci-test /x86_64/ahci/io/dma/lba48/short/zero
==7365==WARNING: ASan doesn't fully support makecontext/swapcontext functions 
and may produce false positives in some cases!
PASS 57 ahci-test /x86_64/ahci/io/dma/lba48/short/low
==7371==WARNING: ASan doesn't fully support makecontext/swapcontext functions 
and may produce false positives in some cases!
PASS 58 ahci-test /x86_64/ahci/io/dma/lba48/short/high
==7377==WARNING: ASan doesn't fully support makecontext/swapcontext functions 
and may produce false positives in some cases!
PASS 59 ahci-test /x86_64/ahci/io/ncq/simple
==7383==WARNING: ASan doesn't fully support makecontext/swapcontext functions 
and may produce false positives in some cases!
PASS 60 ahci-test /x86_64/ahci/io/ncq/retry
==7389==WARNING: ASan doesn't fully support makecontext/swapcontext functions 
and may produce false positives in some cases!
PASS 61 ahci-test /x86_64/ahci/flush/simple
==7395==WARNING: ASan doesn't fully support makecontext/swapcontext functions 
and may produce false positives in some cases!
PASS 62 ahci-test /x86_64/ahci/flush/retry
==7401==WARNING: ASan doesn't fully support makecontext/swapcontext functions 
and may produce false positives in some cases!
==7407==WARNING: ASan doesn't fully support makecontext/swapcontext functions 
and may produce false positives in some cases!
PASS 63 ahci-test /x86_64/ahci/flush/migrate
==7415==WARNING: ASan doesn't fully support makecontext/swapcontext functions 
and may produce false positives in some cases!
==7421==WARNING: ASan doesn't fully support makecontext/swapcontext functions 
and may produce false positives in some cases!
PASS 64 ahci-test /x86_64/ahci/migrate/sanity
==7429==WARNING: ASan doesn't fully support makecontext/swapcontext functions 
and may produce false positives in some cases!
==7435==WARNING: ASan doesn't fully support makecontext/swapcontext functions 
and may produce false positives in some cases!
PASS 65 ahci-test /x86_64/ahci/migrate/dma/simple
==7443==WARNING: ASan doesn't fully support makecontext/swapcontext functions 
and may produce false positives in some cases!
==7449==WARNING: ASan doesn't fully support makecontext/swapcontext functions 
and may produce false positives in some cases!
PASS 66 ahci-test /x86_64/ahci/migrate/dma/halted
==7457==WARNING: ASan doesn't fully support makecontext/swapcontext functions 
and may produce false positives in some cases!
==7463==WARNING: ASan doesn't fully support makecontext/swapcontext functions 
and may produce false positives in some cases!
PASS 67 ahci-test /x86_64/ahci/migrate/ncq/simple
==7471==WARNING: ASan doesn't fully support makecontext/swapcontext functions 
and may produce false positives in some cases!
==7477==WARNING: ASan doesn't fully support makecontext/swapcontext functions 
and may produce false positives in some cases!
PASS 68 ahci-test /x86_64/ahci/migrate/ncq/halted
PASS 1 test-bufferiszero /cutils/bufferiszero
MALLOC_PERTURB_=${MALLOC_PERTURB_:-$(( ${RANDOM:-0} % 255 + 1))}  
tests/test-uuid -m=quick -k --tap < /dev/null | ./scripts/tap-driver.pl 
--test-name="test-uuid" 
---
PASS 4 test-uuid /uuid/unparse
PASS 5 test-uuid /uuid/unparse_strdup
MALLOC_PERTURB_=${MALLOC_PERTURB_:-$(( ${RANDOM:-0} % 255 + 1))}  
tests/ptimer-test -m=quick -k --tap < /dev/null | ./scripts/tap-driver.pl 
--test-name="ptimer-test" 
==7485==WARNING: ASan doesn't fully support makecontext/swapcontext functions 
and may produce false positives in some cases!
PASS 69 ahci-test /x86_64/ahci/cdrom/eject
PASS 1 ptimer-test /ptimer/set_count policy=default
PASS 2 ptimer-test /ptimer/set_limit policy=default
---
PASS 21 test-qgraph /qgraph/test_two_test_same_interface
PASS 22 test-qgraph /qgraph/test_test_in_path
PASS 23 test-qgraph /qgraph/test_double_edge
==7496==WARNING: ASan doesn't fully support makecontext/swapcontext functions 
and may produce false positives in some cases!
PASS 70 ahci-test /x86_64/ahci/cdrom/dma/single
==7509==WARNING: ASan doesn't fully support makecontext/swapcontext functions 
and may produce false positives in some cases!
PASS 71 ahci-test /x86_64/ahci/cdrom/dma/multi
==7515==WARNING: ASan doesn't fully support makecontext/swapcontext functions 
and may produce false positives in some cases!
PASS 72 ahci-test /x86_64/ahci/cdrom/pio/single
==7521==WARNING: ASan doesn't fully support makecontext/swapcontext functions 
and may produce false positives in some cases!
==7521==WARNING: ASan is ignoring requested __asan_handle_no_return: stack top: 
0x7fff6981d000; bottom 0x7f396bbee000; size: 0x00c5fdc2f000 (850365968384)
False positive error reports may follow
For details see https://github.com/google/sanitizers/issues/189
PASS 73 ahci-test /x86_64/ahci/cdrom/pio/multi
==7527==WARNING: ASan doesn't fully support makecontext/swapcontext functions 
and may produce false positives in some cases!
PASS 74 ahci-test /x86_64/ahci/cdrom/pio/bcl
MALLOC_PERTURB_=${MALLOC_PERTURB_:-$(( ${RANDOM:-0} % 255 + 1))}  
QTEST_QEMU_BINARY=x86_64-softmmu/qemu-system-x86_64 QTEST_QEMU_IMG=qemu-img 
tests/qtest/hd-geo-test -m=quick -k --tap < /dev/null | ./scripts/tap-driver.pl 
--test-name="hd-geo-test" 
PASS 1 hd-geo-test /x86_64/hd-geo/ide/none
==7541==WARNING: ASan doesn't fully support makecontext/swapcontext functions 
and may produce false positives in some cases!
PASS 2 hd-geo-test /x86_64/hd-geo/ide/drive/cd_0
==7547==WARNING: ASan doesn't fully support makecontext/swapcontext functions 
and may produce false positives in some cases!
PASS 3 hd-geo-test /x86_64/hd-geo/ide/drive/mbr/blank
==7553==WARNING: ASan doesn't fully support makecontext/swapcontext functions 
and may produce false positives in some cases!
PASS 4 hd-geo-test /x86_64/hd-geo/ide/drive/mbr/lba
==7559==WARNING: ASan doesn't fully support makecontext/swapcontext functions 
and may produce false positives in some cases!
PASS 5 hd-geo-test /x86_64/hd-geo/ide/drive/mbr/chs
==7565==WARNING: ASan doesn't fully support makecontext/swapcontext functions 
and may produce false positives in some cases!
PASS 6 hd-geo-test /x86_64/hd-geo/ide/device/mbr/blank
==7571==WARNING: ASan doesn't fully support makecontext/swapcontext functions 
and may produce false positives in some cases!
PASS 7 hd-geo-test /x86_64/hd-geo/ide/device/mbr/lba
==7577==WARNING: ASan doesn't fully support makecontext/swapcontext functions 
and may produce false positives in some cases!
PASS 8 hd-geo-test /x86_64/hd-geo/ide/device/mbr/chs
==7583==WARNING: ASan doesn't fully support makecontext/swapcontext functions 
and may produce false positives in some cases!
PASS 9 hd-geo-test /x86_64/hd-geo/ide/device/user/chs
==7588==WARNING: ASan doesn't fully support makecontext/swapcontext functions 
and may produce false positives in some cases!
PASS 10 hd-geo-test /x86_64/hd-geo/ide/device/user/chst
==7594==WARNING: ASan doesn't fully support makecontext/swapcontext functions 
and may produce false positives in some cases!
==7598==WARNING: ASan doesn't fully support makecontext/swapcontext functions 
and may produce false positives in some cases!
==7602==WARNING: ASan doesn't fully support makecontext/swapcontext functions 
and may produce false positives in some cases!
==7606==WARNING: ASan doesn't fully support makecontext/swapcontext functions 
and may produce false positives in some cases!
==7610==WARNING: ASan doesn't fully support makecontext/swapcontext functions 
and may produce false positives in some cases!
==7614==WARNING: ASan doesn't fully support makecontext/swapcontext functions 
and may produce false positives in some cases!
==7618==WARNING: ASan doesn't fully support makecontext/swapcontext functions 
and may produce false positives in some cases!
==7622==WARNING: ASan doesn't fully support makecontext/swapcontext functions 
and may produce false positives in some cases!
==7625==WARNING: ASan doesn't fully support makecontext/swapcontext functions 
and may produce false positives in some cases!
PASS 11 hd-geo-test /x86_64/hd-geo/override/ide
==7632==WARNING: ASan doesn't fully support makecontext/swapcontext functions 
and may produce false positives in some cases!
==7636==WARNING: ASan doesn't fully support makecontext/swapcontext functions 
and may produce false positives in some cases!
==7640==WARNING: ASan doesn't fully support makecontext/swapcontext functions 
and may produce false positives in some cases!
==7644==WARNING: ASan doesn't fully support makecontext/swapcontext functions 
and may produce false positives in some cases!
==7648==WARNING: ASan doesn't fully support makecontext/swapcontext functions 
and may produce false positives in some cases!
==7652==WARNING: ASan doesn't fully support makecontext/swapcontext functions 
and may produce false positives in some cases!
==7656==WARNING: ASan doesn't fully support makecontext/swapcontext functions 
and may produce false positives in some cases!
==7660==WARNING: ASan doesn't fully support makecontext/swapcontext functions 
and may produce false positives in some cases!
==7663==WARNING: ASan doesn't fully support makecontext/swapcontext functions 
and may produce false positives in some cases!
PASS 12 hd-geo-test /x86_64/hd-geo/override/scsi
==7670==WARNING: ASan doesn't fully support makecontext/swapcontext functions 
and may produce false positives in some cases!
==7674==WARNING: ASan doesn't fully support makecontext/swapcontext functions 
and may produce false positives in some cases!
==7678==WARNING: ASan doesn't fully support makecontext/swapcontext functions 
and may produce false positives in some cases!
==7682==WARNING: ASan doesn't fully support makecontext/swapcontext functions 
and may produce false positives in some cases!
==7686==WARNING: ASan doesn't fully support makecontext/swapcontext functions 
and may produce false positives in some cases!
==7690==WARNING: ASan doesn't fully support makecontext/swapcontext functions 
and may produce false positives in some cases!
==7694==WARNING: ASan doesn't fully support makecontext/swapcontext functions 
and may produce false positives in some cases!
==7698==WARNING: ASan doesn't fully support makecontext/swapcontext functions 
and may produce false positives in some cases!
==7701==WARNING: ASan doesn't fully support makecontext/swapcontext functions 
and may produce false positives in some cases!
PASS 13 hd-geo-test /x86_64/hd-geo/override/scsi_2_controllers
==7708==WARNING: ASan doesn't fully support makecontext/swapcontext functions 
and may produce false positives in some cases!
==7712==WARNING: ASan doesn't fully support makecontext/swapcontext functions 
and may produce false positives in some cases!
==7716==WARNING: ASan doesn't fully support makecontext/swapcontext functions 
and may produce false positives in some cases!
==7720==WARNING: ASan doesn't fully support makecontext/swapcontext functions 
and may produce false positives in some cases!
==7723==WARNING: ASan doesn't fully support makecontext/swapcontext functions 
and may produce false positives in some cases!
PASS 14 hd-geo-test /x86_64/hd-geo/override/virtio_blk
==7730==WARNING: ASan doesn't fully support makecontext/swapcontext functions 
and may produce false positives in some cases!
==7734==WARNING: ASan doesn't fully support makecontext/swapcontext functions 
and may produce false positives in some cases!
==7737==WARNING: ASan doesn't fully support makecontext/swapcontext functions 
and may produce false positives in some cases!
PASS 15 hd-geo-test /x86_64/hd-geo/override/zero_chs
==7744==WARNING: ASan doesn't fully support makecontext/swapcontext functions 
and may produce false positives in some cases!
==7748==WARNING: ASan doesn't fully support makecontext/swapcontext functions 
and may produce false positives in some cases!
==7752==WARNING: ASan doesn't fully support makecontext/swapcontext functions 
and may produce false positives in some cases!
==7756==WARNING: ASan doesn't fully support makecontext/swapcontext functions 
and may produce false positives in some cases!
==7759==WARNING: ASan doesn't fully support makecontext/swapcontext functions 
and may produce false positives in some cases!
PASS 16 hd-geo-test /x86_64/hd-geo/override/scsi_hot_unplug
==7766==WARNING: ASan doesn't fully support makecontext/swapcontext functions 
and may produce false positives in some cases!
==7770==WARNING: ASan doesn't fully support makecontext/swapcontext functions 
and may produce false positives in some cases!
==7774==WARNING: ASan doesn't fully support makecontext/swapcontext functions 
and may produce false positives in some cases!
==7778==WARNING: ASan doesn't fully support makecontext/swapcontext functions 
and may produce false positives in some cases!
==7781==WARNING: ASan doesn't fully support makecontext/swapcontext functions 
and may produce false positives in some cases!
PASS 17 hd-geo-test /x86_64/hd-geo/override/virtio_hot_unplug
MALLOC_PERTURB_=${MALLOC_PERTURB_:-$(( ${RANDOM:-0} % 255 + 1))}  
QTEST_QEMU_BINARY=x86_64-softmmu/qemu-system-x86_64 QTEST_QEMU_IMG=qemu-img 
tests/qtest/boot-order-test -m=quick -k --tap < /dev/null | 
./scripts/tap-driver.pl --test-name="boot-order-test" 
PASS 1 boot-order-test /x86_64/boot-order/pc
---
Could not access KVM kernel module: No such file or directory
qemu-system-x86_64: -accel kvm: failed to initialize kvm: No such file or 
directory
qemu-system-x86_64: falling back to tcg
==7850==WARNING: ASan doesn't fully support makecontext/swapcontext functions 
and may produce false positives in some cases!

Looking for expected file 'tests/data/acpi/pc/FACP'
Using expected file 'tests/data/acpi/pc/FACP'
---
Could not access KVM kernel module: No such file or directory
qemu-system-x86_64: -accel kvm: failed to initialize kvm: No such file or 
directory
qemu-system-x86_64: falling back to tcg
==7856==WARNING: ASan doesn't fully support makecontext/swapcontext functions 
and may produce false positives in some cases!

Looking for expected file 'tests/data/acpi/q35/FACP'
Using expected file 'tests/data/acpi/q35/FACP'
---
Could not access KVM kernel module: No such file or directory
qemu-system-x86_64: -accel kvm: failed to initialize kvm: No such file or 
directory
qemu-system-x86_64: falling back to tcg
==7862==WARNING: ASan doesn't fully support makecontext/swapcontext functions 
and may produce false positives in some cases!

Looking for expected file 'tests/data/acpi/pc/FACP.bridge'
Looking for expected file 'tests/data/acpi/pc/FACP'
---
Could not access KVM kernel module: No such file or directory
qemu-system-x86_64: -accel kvm: failed to initialize kvm: No such file or 
directory
qemu-system-x86_64: falling back to tcg
==7868==WARNING: ASan doesn't fully support makecontext/swapcontext functions 
and may produce false positives in some cases!

Looking for expected file 'tests/data/acpi/pc/FACP.ipmikcs'
Looking for expected file 'tests/data/acpi/pc/FACP'
---
Could not access KVM kernel module: No such file or directory
qemu-system-x86_64: -accel kvm: failed to initialize kvm: No such file or 
directory
qemu-system-x86_64: falling back to tcg
==7874==WARNING: ASan doesn't fully support makecontext/swapcontext functions 
and may produce false positives in some cases!

Looking for expected file 'tests/data/acpi/pc/FACP.cphp'
Looking for expected file 'tests/data/acpi/pc/FACP'
---
Could not access KVM kernel module: No such file or directory
qemu-system-x86_64: -accel kvm: failed to initialize kvm: No such file or 
directory
qemu-system-x86_64: falling back to tcg
==7881==WARNING: ASan doesn't fully support makecontext/swapcontext functions 
and may produce false positives in some cases!

Looking for expected file 'tests/data/acpi/pc/FACP.memhp'
Looking for expected file 'tests/data/acpi/pc/FACP'
---
Could not access KVM kernel module: No such file or directory
qemu-system-x86_64: -accel kvm: failed to initialize kvm: No such file or 
directory
qemu-system-x86_64: falling back to tcg
==7887==WARNING: ASan doesn't fully support makecontext/swapcontext functions 
and may produce false positives in some cases!

Looking for expected file 'tests/data/acpi/pc/FACP.numamem'
Looking for expected file 'tests/data/acpi/pc/FACP'
---
Could not access KVM kernel module: No such file or directory
qemu-system-x86_64: -accel kvm: failed to initialize kvm: No such file or 
directory
qemu-system-x86_64: falling back to tcg
==7893==WARNING: ASan doesn't fully support makecontext/swapcontext functions 
and may produce false positives in some cases!

Looking for expected file 'tests/data/acpi/pc/FACP.dimmpxm'
Looking for expected file 'tests/data/acpi/pc/FACP'
---
Could not access KVM kernel module: No such file or directory
qemu-system-x86_64: -accel kvm: failed to initialize kvm: No such file or 
directory
qemu-system-x86_64: falling back to tcg
==7902==WARNING: ASan doesn't fully support makecontext/swapcontext functions 
and may produce false positives in some cases!

Looking for expected file 'tests/data/acpi/pc/FACP.acpihmat'
Looking for expected file 'tests/data/acpi/pc/FACP'
---
Could not access KVM kernel module: No such file or directory
qemu-system-x86_64: -accel kvm: failed to initialize kvm: No such file or 
directory
qemu-system-x86_64: falling back to tcg
==7909==WARNING: ASan doesn't fully support makecontext/swapcontext functions 
and may produce false positives in some cases!

Looking for expected file 'tests/data/acpi/q35/FACP.bridge'
Looking for expected file 'tests/data/acpi/q35/FACP'
---
Could not access KVM kernel module: No such file or directory
qemu-system-x86_64: -accel kvm: failed to initialize kvm: No such file or 
directory
qemu-system-x86_64: falling back to tcg
==7915==WARNING: ASan doesn't fully support makecontext/swapcontext functions 
and may produce false positives in some cases!

Looking for expected file 'tests/data/acpi/q35/FACP.mmio64'
Looking for expected file 'tests/data/acpi/q35/FACP'
---
Could not access KVM kernel module: No such file or directory
qemu-system-x86_64: -accel kvm: failed to initialize kvm: No such file or 
directory
qemu-system-x86_64: falling back to tcg
==7921==WARNING: ASan doesn't fully support makecontext/swapcontext functions 
and may produce false positives in some cases!

Looking for expected file 'tests/data/acpi/q35/FACP.ipmibt'
Looking for expected file 'tests/data/acpi/q35/FACP'
---
Could not access KVM kernel module: No such file or directory
qemu-system-x86_64: -accel kvm: failed to initialize kvm: No such file or 
directory
qemu-system-x86_64: falling back to tcg
==7927==WARNING: ASan doesn't fully support makecontext/swapcontext functions 
and may produce false positives in some cases!

Looking for expected file 'tests/data/acpi/q35/FACP.cphp'
Looking for expected file 'tests/data/acpi/q35/FACP'
---
Could not access KVM kernel module: No such file or directory
qemu-system-x86_64: -accel kvm: failed to initialize kvm: No such file or 
directory
qemu-system-x86_64: falling back to tcg
==7934==WARNING: ASan doesn't fully support makecontext/swapcontext functions 
and may produce false positives in some cases!

Looking for expected file 'tests/data/acpi/q35/FACP.memhp'
Looking for expected file 'tests/data/acpi/q35/FACP'
---
Could not access KVM kernel module: No such file or directory
qemu-system-x86_64: -accel kvm: failed to initialize kvm: No such file or 
directory
qemu-system-x86_64: falling back to tcg
==7940==WARNING: ASan doesn't fully support makecontext/swapcontext functions 
and may produce false positives in some cases!

Looking for expected file 'tests/data/acpi/q35/FACP.numamem'
Looking for expected file 'tests/data/acpi/q35/FACP'
---
Could not access KVM kernel module: No such file or directory
qemu-system-x86_64: -accel kvm: failed to initialize kvm: No such file or 
directory
qemu-system-x86_64: falling back to tcg
==7946==WARNING: ASan doesn't fully support makecontext/swapcontext functions 
and may produce false positives in some cases!

Looking for expected file 'tests/data/acpi/q35/FACP.dimmpxm'
Looking for expected file 'tests/data/acpi/q35/FACP'
---
Could not access KVM kernel module: No such file or directory
qemu-system-x86_64: -accel kvm: failed to initialize kvm: No such file or 
directory
qemu-system-x86_64: falling back to tcg
==7955==WARNING: ASan doesn't fully support makecontext/swapcontext functions 
and may produce false positives in some cases!

Looking for expected file 'tests/data/acpi/q35/FACP.acpihmat'
Looking for expected file 'tests/data/acpi/q35/FACP'
---
PASS 1 i440fx-test /x86_64/i440fx/defaults
PASS 2 i440fx-test /x86_64/i440fx/pam
PASS 3 i440fx-test /x86_64/i440fx/firmware/bios
==8047==WARNING: ASan doesn't fully support makecontext/swapcontext functions 
and may produce false positives in some cases!
PASS 4 i440fx-test /x86_64/i440fx/firmware/pflash
MALLOC_PERTURB_=${MALLOC_PERTURB_:-$(( ${RANDOM:-0} % 255 + 1))}  
QTEST_QEMU_BINARY=x86_64-softmmu/qemu-system-x86_64 QTEST_QEMU_IMG=qemu-img 
tests/qtest/fw_cfg-test -m=quick -k --tap < /dev/null | ./scripts/tap-driver.pl 
--test-name="fw_cfg-test" 
PASS 1 fw_cfg-test /x86_64/fw_cfg/signature
---
MALLOC_PERTURB_=${MALLOC_PERTURB_:-$(( ${RANDOM:-0} % 255 + 1))}  
QTEST_QEMU_BINARY=x86_64-softmmu/qemu-system-x86_64 QTEST_QEMU_IMG=qemu-img 
tests/qtest/drive_del-test -m=quick -k --tap < /dev/null | 
./scripts/tap-driver.pl --test-name="drive_del-test" 
PASS 1 drive_del-test /x86_64/drive_del/without-dev
PASS 2 drive_del-test /x86_64/drive_del/after_failed_device_add
==8140==WARNING: ASan doesn't fully support makecontext/swapcontext functions 
and may produce false positives in some cases!
PASS 3 drive_del-test /x86_64/blockdev/drive_del_device_del
MALLOC_PERTURB_=${MALLOC_PERTURB_:-$(( ${RANDOM:-0} % 255 + 1))}  
QTEST_QEMU_BINARY=x86_64-softmmu/qemu-system-x86_64 QTEST_QEMU_IMG=qemu-img 
tests/qtest/wdt_ib700-test -m=quick -k --tap < /dev/null | 
./scripts/tap-driver.pl --test-name="wdt_ib700-test" 
PASS 1 wdt_ib700-test /x86_64/wdt_ib700/pause
---
dbus-daemon[8310]: Could not get password database information for UID of 
current process: User "???" unknown or no memory to allocate password entry

**
ERROR:/tmp/qemu-test/src/tests/qtest/dbus-vmstate-test.c:114:get_connection: 
assertion failed (err == NULL): The connection is closed (g-io-error-quark, 18)
ERROR - Bail out! 
ERROR:/tmp/qemu-test/src/tests/qtest/dbus-vmstate-test.c:114:get_connection: 
assertion failed (err == NULL): The connection is closed (g-io-error-quark, 18)
cleaning up pid 8310
make: *** [/tmp/qemu-test/src/tests/Makefile.include:632: check-qtest-x86_64] 
Error 1
make: *** Waiting for unfinished jobs....
Traceback (most recent call last):
  File "./tests/docker/docker.py", line 664, in <module>
---
    raise CalledProcessError(retcode, cmd)
subprocess.CalledProcessError: Command '['sudo', '-n', 'docker', 'run', 
'--label', 'com.qemu.instance.uuid=a94acdadbb0d48158881606b743eb99a', '-u', 
'1003', '--security-opt', 'seccomp=unconfined', '--rm', '-e', 
'TARGET_LIST=x86_64-softmmu', '-e', 'EXTRA_CONFIGURE_OPTS=', '-e', 'V=', '-e', 
'J=14', '-e', 'DEBUG=', '-e', 'SHOW_ENV=', '-e', 'CCACHE_DIR=/var/tmp/ccache', 
'-v', '/home/patchew2/.cache/qemu-docker-ccache:/var/tmp/ccache:z', '-v', 
'/var/tmp/patchew-tester-tmp-xetae54n/src/docker-src.2020-03-11-18.34.34.32158:/var/tmp/qemu:z,ro',
 'qemu:fedora', '/var/tmp/qemu/run', 'test-debug']' returned non-zero exit 
status 2.
filter=--filter=label=com.qemu.instance.uuid=a94acdadbb0d48158881606b743eb99a
make[1]: *** [docker-run] Error 1
make[1]: Leaving directory `/var/tmp/patchew-tester-tmp-xetae54n/src'
make: *** [docker-run-test-debug@fedora] Error 2

real    28m4.111s
user    0m8.861s


The full log is available at
http://patchew.org/logs/address@hidden/testing.asan/?type=message.
---
Email generated automatically by Patchew [https://patchew.org/].
Please send your feedback to address@hidden

reply via email to

[Prev in Thread] Current Thread [Next in Thread]