qemu-devel
[Top][All Lists]
Advanced

[Date Prev][Date Next][Thread Prev][Thread Next][Date Index][Thread Index]

[PATCH v2 04/12] tests/Makefile: Restrict some softmmu-only tests


From: Philippe Mathieu-Daudé
Subject: [PATCH v2 04/12] tests/Makefile: Restrict some softmmu-only tests
Date: Mon, 16 Mar 2020 00:57:08 +0100

In the next commit we are going to remove some objects from the
util-obj-y variable (objects which are not used by user-mode,
when configured with --disable-system).
Then some system-mode tests are going to fail, due to the missing
objects:

  $ make check-unit -k
    LINK    tests/test-iov
  /usr/bin/ld: tests/test-iov.o: in function `iov_from_buf':
  include/qemu/iov.h:49: undefined reference to `iov_from_buf_full'
  make: *** [rules.mak:124: tests/test-iov] Error 1
    LINK    tests/test-timed-average
  /usr/bin/ld: tests/test-timed-average.o: in function `account':
  tests/test-timed-average.c:27: undefined reference to `timed_average_account'
  make: *** [rules.mak:124: tests/test-timed-average] Error 1
    LINK    tests/test-util-filemonitor
  /usr/bin/ld: tests/test-util-filemonitor.o: in function 
`qemu_file_monitor_test_event_loop':
  tests/test-util-filemonitor.c:83: undefined reference to `main_loop_wait'
  make: *** [rules.mak:124: tests/test-util-filemonitor] Error 1
    LINK    tests/test-util-sockets
  /usr/bin/ld: tests/test-util-sockets.o: in function 
`test_socket_fd_pass_name_good':
  tests/test-util-sockets.c:91: undefined reference to `socket_connect'
  make: *** [rules.mak:124: tests/test-util-sockets] Error 1
    LINK    tests/test-base64
  /usr/bin/ld: tests/test-base64.o: in function `test_base64_good':
  tests/test-base64.c:35: undefined reference to `qbase64_decode'
  collect2: error: ld returned 1 exit status
  make: *** [rules.mak:124: tests/test-base64] Error 1
    LINK    tests/test-bufferiszero
  /usr/bin/ld: tests/test-bufferiszero.o: in function `test_1':
  tests/test-bufferiszero.c:31: undefined reference to `buffer_is_zero'
  make: *** [rules.mak:124: tests/test-bufferiszero] Error 1
  make: Target 'check-unit' not remade because of errors.

Instead, restrict these tests to system-mode, by using the
$(CONFIG_SOFTMMU) variable.

Reviewed-by: Richard Henderson <address@hidden>
Tested-by: Richard Henderson <address@hidden>
Signed-off-by: Philippe Mathieu-Daudé <address@hidden>
---
v2: Reworded description with example (rth)
---
 tests/Makefile.include | 16 ++++++++--------
 1 file changed, 8 insertions(+), 8 deletions(-)

diff --git a/tests/Makefile.include b/tests/Makefile.include
index 99db5eb3e0..bf11f765c3 100644
--- a/tests/Makefile.include
+++ b/tests/Makefile.include
@@ -64,14 +64,14 @@ check-unit-y += tests/check-qlit$(EXESUF)
 check-unit-y += tests/test-qobject-output-visitor$(EXESUF)
 check-unit-y += tests/test-clone-visitor$(EXESUF)
 check-unit-y += tests/test-qobject-input-visitor$(EXESUF)
-check-unit-y += tests/test-qmp-cmds$(EXESUF)
+check-unit-$(CONFIG_SOFTMMU) += tests/test-qmp-cmds$(EXESUF)
 check-unit-y += tests/test-string-input-visitor$(EXESUF)
 check-unit-y += tests/test-string-output-visitor$(EXESUF)
 check-unit-y += tests/test-qmp-event$(EXESUF)
 check-unit-y += tests/test-opts-visitor$(EXESUF)
 check-unit-$(CONFIG_BLOCK) += tests/test-coroutine$(EXESUF)
 check-unit-y += tests/test-visitor-serialization$(EXESUF)
-check-unit-y += tests/test-iov$(EXESUF)
+check-unit-$(CONFIG_SOFTMMU) += tests/test-iov$(EXESUF)
 check-unit-y += tests/test-bitmap$(EXESUF)
 check-unit-$(CONFIG_BLOCK) += tests/test-aio$(EXESUF)
 check-unit-$(CONFIG_BLOCK) += tests/test-aio-multithread$(EXESUF)
@@ -106,7 +106,7 @@ check-unit-y += tests/test-qht$(EXESUF)
 check-unit-y += tests/test-qht-par$(EXESUF)
 check-unit-y += tests/test-bitops$(EXESUF)
 check-unit-y += tests/test-bitcnt$(EXESUF)
-check-unit-y += tests/test-qdev-global-props$(EXESUF)
+check-unit-$(CONFIG_SOFTMMU) += tests/test-qdev-global-props$(EXESUF)
 check-unit-y += tests/check-qom-interface$(EXESUF)
 check-unit-y += tests/check-qom-proplist$(EXESUF)
 check-unit-y += tests/test-qemu-opts$(EXESUF)
@@ -124,9 +124,9 @@ check-unit-$(call land,$(CONFIG_BLOCK),$(CONFIG_GNUTLS)) += 
tests/test-crypto-tl
 ifneq (,$(findstring qemu-ga,$(TOOLS)))
 check-unit-$(call land,$(CONFIG_LINUX),$(CONFIG_VIRTIO_SERIAL)) += 
tests/test-qga$(EXESUF)
 endif
-check-unit-y += tests/test-timed-average$(EXESUF)
-check-unit-$(CONFIG_INOTIFY1) += tests/test-util-filemonitor$(EXESUF)
-check-unit-y += tests/test-util-sockets$(EXESUF)
+check-unit-$(CONFIG_SOFTMMU) += tests/test-timed-average$(EXESUF)
+check-unit-$(call land,$(CONFIG_SOFTMMU),$(CONFIG_INOTIFY1)) += 
tests/test-util-filemonitor$(EXESUF)
+check-unit-$(CONFIG_SOFTMMU) += tests/test-util-sockets$(EXESUF)
 check-unit-$(CONFIG_BLOCK) += tests/test-authz-simple$(EXESUF)
 check-unit-$(CONFIG_BLOCK) += tests/test-authz-list$(EXESUF)
 check-unit-$(CONFIG_BLOCK) += tests/test-authz-listfile$(EXESUF)
@@ -137,7 +137,7 @@ check-unit-$(CONFIG_BLOCK) += 
tests/test-io-channel-file$(EXESUF)
 check-unit-$(call land,$(CONFIG_BLOCK),$(CONFIG_GNUTLS)) += 
tests/test-io-channel-tls$(EXESUF)
 check-unit-$(CONFIG_BLOCK) += tests/test-io-channel-command$(EXESUF)
 check-unit-$(CONFIG_BLOCK) += tests/test-io-channel-buffer$(EXESUF)
-check-unit-y += tests/test-base64$(EXESUF)
+check-unit-$(CONFIG_SOFTMMU) += tests/test-base64$(EXESUF)
 check-unit-$(call land,$(CONFIG_BLOCK),$(if 
$(CONFIG_NETTLE),y,$(CONFIG_GCRYPT))) += tests/test-crypto-pbkdf$(EXESUF)
 check-unit-$(CONFIG_BLOCK) += tests/test-crypto-ivgen$(EXESUF)
 check-unit-$(CONFIG_BLOCK)  += tests/test-crypto-afsplit$(EXESUF)
@@ -145,7 +145,7 @@ check-unit-$(call 
land,$(CONFIG_BLOCK),$(CONFIG_QEMU_PRIVATE_XTS)) += tests/test
 check-unit-$(CONFIG_BLOCK)  += tests/test-crypto-block$(EXESUF)
 check-unit-y += tests/test-logging$(EXESUF)
 check-unit-$(call land,$(CONFIG_BLOCK),$(CONFIG_REPLICATION)) += 
tests/test-replication$(EXESUF)
-check-unit-y += tests/test-bufferiszero$(EXESUF)
+check-unit-$(CONFIG_SOFTMMU) += tests/test-bufferiszero$(EXESUF)
 check-unit-y += tests/test-uuid$(EXESUF)
 check-unit-y += tests/ptimer-test$(EXESUF)
 check-unit-y += tests/test-qapi-util$(EXESUF)
-- 
2.21.1




reply via email to

[Prev in Thread] Current Thread [Next in Thread]