qemu-devel
[Top][All Lists]
Advanced

[Date Prev][Date Next][Thread Prev][Thread Next][Date Index][Thread Index]

Re: [PULL 00/61] Misc patches for soft freeze


From: no-reply
Subject: Re: [PULL 00/61] Misc patches for soft freeze
Date: Mon, 16 Mar 2020 17:27:38 -0700 (PDT)

Patchew URL: https://patchew.org/QEMU/address@hidden/



Hi,

This series failed the asan build test. Please find the testing commands and
their output below. If you have Docker installed, you can probably reproduce it
locally.

=== TEST SCRIPT BEGIN ===
#!/bin/bash
export ARCH=x86_64
make docker-image-fedora V=1 NETWORK=1
time make docker-test-debug@fedora TARGET_LIST=x86_64-softmmu J=14 NETWORK=1
=== TEST SCRIPT END ===

PASS 1 fdc-test /x86_64/fdc/cmos
PASS 2 fdc-test /x86_64/fdc/no_media_on_start
PASS 3 fdc-test /x86_64/fdc/read_without_media
==11429==WARNING: ASan doesn't fully support makecontext/swapcontext functions 
and may produce false positives in some cases!
PASS 4 fdc-test /x86_64/fdc/media_change
PASS 5 fdc-test /x86_64/fdc/sense_interrupt
PASS 6 fdc-test /x86_64/fdc/relative_seek
---
PASS 32 test-opts-visitor /visitor/opts/range/beyond
PASS 33 test-opts-visitor /visitor/opts/dict/unvisited
MALLOC_PERTURB_=${MALLOC_PERTURB_:-$(( ${RANDOM:-0} % 255 + 1))}  
tests/test-coroutine -m=quick -k --tap < /dev/null | ./scripts/tap-driver.pl 
--test-name="test-coroutine" 
==11484==WARNING: ASan doesn't fully support makecontext/swapcontext functions 
and may produce false positives in some cases!
==11484==WARNING: ASan is ignoring requested __asan_handle_no_return: stack 
top: 0x7ffda0e60000; bottom 0x7fa1c9d20000; size: 0x005bd7140000 (394450436096)
False positive error reports may follow
For details see https://github.com/google/sanitizers/issues/189
PASS 1 test-coroutine /basic/no-dangling-access
---
PASS 12 fdc-test /x86_64/fdc/read_no_dma_19
PASS 13 fdc-test /x86_64/fdc/fuzz-registers
MALLOC_PERTURB_=${MALLOC_PERTURB_:-$(( ${RANDOM:-0} % 255 + 1))}  
QTEST_QEMU_BINARY=x86_64-softmmu/qemu-system-x86_64 QTEST_QEMU_IMG=qemu-img 
tests/qtest/ide-test -m=quick -k --tap < /dev/null | ./scripts/tap-driver.pl 
--test-name="ide-test" 
==11499==WARNING: ASan doesn't fully support makecontext/swapcontext functions 
and may produce false positives in some cases!
PASS 14 test-aio /aio/timer/schedule
PASS 15 test-aio /aio/coroutine/queue-chaining
PASS 16 test-aio /aio-gsource/flush
---
PASS 25 test-aio /aio-gsource/event/wait
PASS 26 test-aio /aio-gsource/event/flush
PASS 27 test-aio /aio-gsource/event/wait/no-flush-cb
==11507==WARNING: ASan doesn't fully support makecontext/swapcontext functions 
and may produce false positives in some cases!
PASS 1 ide-test /x86_64/ide/identify
==11513==WARNING: ASan doesn't fully support makecontext/swapcontext functions 
and may produce false positives in some cases!
PASS 28 test-aio /aio-gsource/timer/schedule
MALLOC_PERTURB_=${MALLOC_PERTURB_:-$(( ${RANDOM:-0} % 255 + 1))}  
tests/test-aio-multithread -m=quick -k --tap < /dev/null | 
./scripts/tap-driver.pl --test-name="test-aio-multithread" 
==11520==WARNING: ASan doesn't fully support makecontext/swapcontext functions 
and may produce false positives in some cases!
PASS 1 test-aio-multithread /aio/multi/lifecycle
PASS 2 ide-test /x86_64/ide/flush
==11533==WARNING: ASan doesn't fully support makecontext/swapcontext functions 
and may produce false positives in some cases!
PASS 2 test-aio-multithread /aio/multi/schedule
PASS 3 ide-test /x86_64/ide/bmdma/simple_rw
==11544==WARNING: ASan doesn't fully support makecontext/swapcontext functions 
and may produce false positives in some cases!
PASS 4 ide-test /x86_64/ide/bmdma/trim
PASS 3 test-aio-multithread /aio/multi/mutex/contended
==11550==WARNING: ASan doesn't fully support makecontext/swapcontext functions 
and may produce false positives in some cases!
PASS 4 test-aio-multithread /aio/multi/mutex/handoff
PASS 5 test-aio-multithread /aio/multi/mutex/mcs
PASS 6 test-aio-multithread /aio/multi/mutex/pthread
MALLOC_PERTURB_=${MALLOC_PERTURB_:-$(( ${RANDOM:-0} % 255 + 1))}  
tests/test-throttle -m=quick -k --tap < /dev/null | ./scripts/tap-driver.pl 
--test-name="test-throttle" 
==11572==WARNING: ASan doesn't fully support makecontext/swapcontext functions 
and may produce false positives in some cases!
PASS 1 test-throttle /throttle/leak_bucket
PASS 2 test-throttle /throttle/compute_wait
PASS 3 test-throttle /throttle/init
---
PASS 14 test-throttle /throttle/config/max
PASS 15 test-throttle /throttle/config/iops_size
MALLOC_PERTURB_=${MALLOC_PERTURB_:-$(( ${RANDOM:-0} % 255 + 1))}  
tests/test-thread-pool -m=quick -k --tap < /dev/null | ./scripts/tap-driver.pl 
--test-name="test-thread-pool" 
==11576==WARNING: ASan doesn't fully support makecontext/swapcontext functions 
and may produce false positives in some cases!
PASS 1 test-thread-pool /thread-pool/submit
PASS 2 test-thread-pool /thread-pool/submit-aio
PASS 3 test-thread-pool /thread-pool/submit-co
PASS 4 test-thread-pool /thread-pool/submit-many
==11643==WARNING: ASan doesn't fully support makecontext/swapcontext functions 
and may produce false positives in some cases!
PASS 5 test-thread-pool /thread-pool/cancel
PASS 6 test-thread-pool /thread-pool/cancel-async
MALLOC_PERTURB_=${MALLOC_PERTURB_:-$(( ${RANDOM:-0} % 255 + 1))}  
tests/test-hbitmap -m=quick -k --tap < /dev/null | ./scripts/tap-driver.pl 
--test-name="test-hbitmap" 
---
PASS 28 test-hbitmap /hbitmap/truncate/shrink/medium
PASS 29 test-hbitmap /hbitmap/truncate/shrink/large
PASS 30 test-hbitmap /hbitmap/meta/zero
==11653==WARNING: ASan doesn't fully support makecontext/swapcontext functions 
and may produce false positives in some cases!
PASS 31 test-hbitmap /hbitmap/meta/one
PASS 32 test-hbitmap /hbitmap/meta/byte
PASS 33 test-hbitmap /hbitmap/meta/word
==11659==WARNING: ASan doesn't fully support makecontext/swapcontext functions 
and may produce false positives in some cases!
PASS 34 test-hbitmap /hbitmap/meta/sector
PASS 35 test-hbitmap /hbitmap/serialize/align
PASS 36 test-hbitmap /hbitmap/serialize/basic
---
PASS 44 test-hbitmap /hbitmap/next_dirty_area/next_dirty_area_4
PASS 45 test-hbitmap /hbitmap/next_dirty_area/next_dirty_area_after_truncate
MALLOC_PERTURB_=${MALLOC_PERTURB_:-$(( ${RANDOM:-0} % 255 + 1))}  
tests/test-bdrv-drain -m=quick -k --tap < /dev/null | ./scripts/tap-driver.pl 
--test-name="test-bdrv-drain" 
==11666==WARNING: ASan doesn't fully support makecontext/swapcontext functions 
and may produce false positives in some cases!
PASS 1 test-bdrv-drain /bdrv-drain/nested
PASS 2 test-bdrv-drain /bdrv-drain/multiparent
PASS 3 test-bdrv-drain /bdrv-drain/set_aio_context
---
PASS 41 test-bdrv-drain /bdrv-drain/bdrv_drop_intermediate/poll
PASS 42 test-bdrv-drain /bdrv-drain/replace_child/mid-drain
MALLOC_PERTURB_=${MALLOC_PERTURB_:-$(( ${RANDOM:-0} % 255 + 1))}  
tests/test-bdrv-graph-mod -m=quick -k --tap < /dev/null | 
./scripts/tap-driver.pl --test-name="test-bdrv-graph-mod" 
==11705==WARNING: ASan doesn't fully support makecontext/swapcontext functions 
and may produce false positives in some cases!
PASS 1 test-bdrv-graph-mod /bdrv-graph-mod/update-perm-tree
PASS 2 test-bdrv-graph-mod /bdrv-graph-mod/should-update-child
MALLOC_PERTURB_=${MALLOC_PERTURB_:-$(( ${RANDOM:-0} % 255 + 1))}  
tests/test-blockjob -m=quick -k --tap < /dev/null | ./scripts/tap-driver.pl 
--test-name="test-blockjob" 
==11709==WARNING: ASan doesn't fully support makecontext/swapcontext functions 
and may produce false positives in some cases!
PASS 1 test-blockjob /blockjob/ids
PASS 2 test-blockjob /blockjob/cancel/created
PASS 3 test-blockjob /blockjob/cancel/running
---
PASS 7 test-blockjob /blockjob/cancel/pending
PASS 8 test-blockjob /blockjob/cancel/concluded
MALLOC_PERTURB_=${MALLOC_PERTURB_:-$(( ${RANDOM:-0} % 255 + 1))}  
tests/test-blockjob-txn -m=quick -k --tap < /dev/null | ./scripts/tap-driver.pl 
--test-name="test-blockjob-txn" 
==11713==WARNING: ASan doesn't fully support makecontext/swapcontext functions 
and may produce false positives in some cases!
PASS 1 test-blockjob-txn /single/success
PASS 2 test-blockjob-txn /single/failure
PASS 3 test-blockjob-txn /single/cancel
---
PASS 6 test-blockjob-txn /pair/cancel
PASS 7 test-blockjob-txn /pair/fail-cancel-race
MALLOC_PERTURB_=${MALLOC_PERTURB_:-$(( ${RANDOM:-0} % 255 + 1))}  
tests/test-block-backend -m=quick -k --tap < /dev/null | 
./scripts/tap-driver.pl --test-name="test-block-backend" 
==11717==WARNING: ASan doesn't fully support makecontext/swapcontext functions 
and may produce false positives in some cases!
PASS 1 test-block-backend /block-backend/drain_aio_error
PASS 2 test-block-backend /block-backend/drain_all_aio_error
MALLOC_PERTURB_=${MALLOC_PERTURB_:-$(( ${RANDOM:-0} % 255 + 1))}  
tests/test-block-iothread -m=quick -k --tap < /dev/null | 
./scripts/tap-driver.pl --test-name="test-block-iothread" 
==11721==WARNING: ASan doesn't fully support makecontext/swapcontext functions 
and may produce false positives in some cases!
PASS 1 test-block-iothread /sync-op/pread
PASS 2 test-block-iothread /sync-op/pwrite
PASS 3 test-block-iothread /sync-op/load_vmstate
---
PASS 15 test-block-iothread /propagate/diamond
PASS 16 test-block-iothread /propagate/mirror
MALLOC_PERTURB_=${MALLOC_PERTURB_:-$(( ${RANDOM:-0} % 255 + 1))}  
tests/test-image-locking -m=quick -k --tap < /dev/null | 
./scripts/tap-driver.pl --test-name="test-image-locking" 
==11741==WARNING: ASan doesn't fully support makecontext/swapcontext functions 
and may produce false positives in some cases!
PASS 1 test-image-locking /image-locking/basic
PASS 2 test-image-locking /image-locking/set-perm-abort
MALLOC_PERTURB_=${MALLOC_PERTURB_:-$(( ${RANDOM:-0} % 255 + 1))}  
tests/test-x86-cpuid -m=quick -k --tap < /dev/null | ./scripts/tap-driver.pl 
--test-name="test-x86-cpuid" 
---
PASS 5 test-xbzrle /xbzrle/encode_decode_overflow
PASS 6 test-xbzrle /xbzrle/encode_decode
MALLOC_PERTURB_=${MALLOC_PERTURB_:-$(( ${RANDOM:-0} % 255 + 1))}  
tests/test-vmstate -m=quick -k --tap < /dev/null | ./scripts/tap-driver.pl 
--test-name="test-vmstate" 
==11747==WARNING: ASan doesn't fully support makecontext/swapcontext functions 
and may produce false positives in some cases!
PASS 1 test-vmstate /vmstate/tmp_struct
PASS 2 test-vmstate /vmstate/simple/primitive
PASS 3 test-vmstate /vmstate/simple/array
---
MALLOC_PERTURB_=${MALLOC_PERTURB_:-$(( ${RANDOM:-0} % 255 + 1))}  
tests/test-rcu-list -m=quick -k --tap < /dev/null | ./scripts/tap-driver.pl 
--test-name="test-rcu-list" 
PASS 1 test-rcu-list /rcu/qlist/single-threaded
PASS 2 test-rcu-list /rcu/qlist/short-few
==11832==WARNING: ASan doesn't fully support makecontext/swapcontext functions 
and may produce false positives in some cases!
PASS 3 test-rcu-list /rcu/qlist/long-many
MALLOC_PERTURB_=${MALLOC_PERTURB_:-$(( ${RANDOM:-0} % 255 + 1))}  
tests/test-rcu-simpleq -m=quick -k --tap < /dev/null | ./scripts/tap-driver.pl 
--test-name="test-rcu-simpleq" 
PASS 1 test-rcu-simpleq /rcu/qsimpleq/single-threaded
PASS 2 test-rcu-simpleq /rcu/qsimpleq/short-few
PASS 3 test-rcu-simpleq /rcu/qsimpleq/long-many
MALLOC_PERTURB_=${MALLOC_PERTURB_:-$(( ${RANDOM:-0} % 255 + 1))}  
tests/test-rcu-tailq -m=quick -k --tap < /dev/null | ./scripts/tap-driver.pl 
--test-name="test-rcu-tailq" 
==11871==WARNING: ASan doesn't fully support makecontext/swapcontext functions 
and may produce false positives in some cases!
PASS 1 test-rcu-tailq /rcu/qtailq/single-threaded
PASS 2 test-rcu-tailq /rcu/qtailq/short-few
PASS 3 test-rcu-tailq /rcu/qtailq/long-many
MALLOC_PERTURB_=${MALLOC_PERTURB_:-$(( ${RANDOM:-0} % 255 + 1))}  
tests/test-rcu-slist -m=quick -k --tap < /dev/null | ./scripts/tap-driver.pl 
--test-name="test-rcu-slist" 
PASS 1 test-rcu-slist /rcu/qslist/single-threaded
PASS 2 test-rcu-slist /rcu/qslist/short-few
==11922==WARNING: ASan doesn't fully support makecontext/swapcontext functions 
and may produce false positives in some cases!
PASS 3 test-rcu-slist /rcu/qslist/long-many
MALLOC_PERTURB_=${MALLOC_PERTURB_:-$(( ${RANDOM:-0} % 255 + 1))}  
tests/test-qdist -m=quick -k --tap < /dev/null | ./scripts/tap-driver.pl 
--test-name="test-qdist" 
PASS 1 test-qdist /qdist/none
---
PASS 7 test-qdist /qdist/binning/expand
PASS 8 test-qdist /qdist/binning/shrink
MALLOC_PERTURB_=${MALLOC_PERTURB_:-$(( ${RANDOM:-0} % 255 + 1))}  
tests/test-qht -m=quick -k --tap < /dev/null | ./scripts/tap-driver.pl 
--test-name="test-qht" 
==11956==WARNING: ASan doesn't fully support makecontext/swapcontext functions 
and may produce false positives in some cases!
PASS 5 ide-test /x86_64/ide/bmdma/various_prdts
==11962==WARNING: ASan doesn't fully support makecontext/swapcontext functions 
and may produce false positives in some cases!
==11962==WARNING: ASan is ignoring requested __asan_handle_no_return: stack 
top: 0x7ffd414e9000; bottom 0x7f452d5fe000; size: 0x00b813eeb000 (790608392192)
False positive error reports may follow
For details see https://github.com/google/sanitizers/issues/189
PASS 6 ide-test /x86_64/ide/bmdma/no_busmaster
---
PASS 1 test-qht /qht/mode/default
PASS 2 test-qht /qht/mode/resize
MALLOC_PERTURB_=${MALLOC_PERTURB_:-$(( ${RANDOM:-0} % 255 + 1))}  
tests/test-qht-par -m=quick -k --tap < /dev/null | ./scripts/tap-driver.pl 
--test-name="test-qht-par" 
==11973==WARNING: ASan doesn't fully support makecontext/swapcontext functions 
and may produce false positives in some cases!
PASS 8 ide-test /x86_64/ide/flush/empty_drive
==11987==WARNING: ASan doesn't fully support makecontext/swapcontext functions 
and may produce false positives in some cases!
PASS 9 ide-test /x86_64/ide/flush/retry_pci
PASS 1 test-qht-par /qht/parallel/2threads-0%updates-1s
==11993==WARNING: ASan doesn't fully support makecontext/swapcontext functions 
and may produce false positives in some cases!
PASS 2 test-qht-par /qht/parallel/2threads-20%updates-1s
MALLOC_PERTURB_=${MALLOC_PERTURB_:-$(( ${RANDOM:-0} % 255 + 1))}  
tests/test-bitops -m=quick -k --tap < /dev/null | ./scripts/tap-driver.pl 
--test-name="test-bitops" 
PASS 10 ide-test /x86_64/ide/flush/retry_isa
---
PASS 3 test-qdev-global-props /qdev/properties/dynamic/global
PASS 4 test-qdev-global-props /qdev/properties/global/subclass
MALLOC_PERTURB_=${MALLOC_PERTURB_:-$(( ${RANDOM:-0} % 255 + 1))}  
tests/check-qom-interface -m=quick -k --tap < /dev/null | 
./scripts/tap-driver.pl --test-name="check-qom-interface" 
==12008==WARNING: ASan doesn't fully support makecontext/swapcontext functions 
and may produce false positives in some cases!
PASS 11 ide-test /x86_64/ide/cdrom/pio
PASS 1 check-qom-interface /qom/interface/direct_impl
PASS 2 check-qom-interface /qom/interface/intermediate_impl
---
PASS 9 test-keyval /keyval/visit/alternate
PASS 10 test-keyval /keyval/visit/any
MALLOC_PERTURB_=${MALLOC_PERTURB_:-$(( ${RANDOM:-0} % 255 + 1))}  
tests/test-write-threshold -m=quick -k --tap < /dev/null | 
./scripts/tap-driver.pl --test-name="test-write-threshold" 
==12035==WARNING: ASan doesn't fully support makecontext/swapcontext functions 
and may produce false positives in some cases!
PASS 1 test-write-threshold /write-threshold/not-set-on-init
PASS 2 test-write-threshold /write-threshold/set-get
PASS 3 test-write-threshold /write-threshold/multi-set-get
---
PASS 15 test-crypto-secret /crypto/secret/crypt/missingiv
PASS 16 test-crypto-secret /crypto/secret/crypt/badiv
MALLOC_PERTURB_=${MALLOC_PERTURB_:-$(( ${RANDOM:-0} % 255 + 1))}  
tests/test-crypto-tlscredsx509 -m=quick -k --tap < /dev/null | 
./scripts/tap-driver.pl --test-name="test-crypto-tlscredsx509" 
==12073==WARNING: ASan doesn't fully support makecontext/swapcontext functions 
and may produce false positives in some cases!
PASS 13 ide-test /x86_64/ide/cdrom/dma
MALLOC_PERTURB_=${MALLOC_PERTURB_:-$(( ${RANDOM:-0} % 255 + 1))}  
QTEST_QEMU_BINARY=x86_64-softmmu/qemu-system-x86_64 QTEST_QEMU_IMG=qemu-img 
tests/qtest/ahci-test -m=quick -k --tap < /dev/null | ./scripts/tap-driver.pl 
--test-name="ahci-test" 
PASS 1 test-crypto-tlscredsx509 /qcrypto/tlscredsx509/perfectserver
PASS 2 test-crypto-tlscredsx509 /qcrypto/tlscredsx509/perfectclient
PASS 3 test-crypto-tlscredsx509 /qcrypto/tlscredsx509/goodca1
PASS 4 test-crypto-tlscredsx509 /qcrypto/tlscredsx509/goodca2
==12091==WARNING: ASan doesn't fully support makecontext/swapcontext functions 
and may produce false positives in some cases!
PASS 1 ahci-test /x86_64/ahci/sanity
==12097==WARNING: ASan doesn't fully support makecontext/swapcontext functions 
and may produce false positives in some cases!
PASS 2 ahci-test /x86_64/ahci/pci_spec
PASS 5 test-crypto-tlscredsx509 /qcrypto/tlscredsx509/goodca3
PASS 6 test-crypto-tlscredsx509 /qcrypto/tlscredsx509/badca1
---
PASS 8 test-crypto-tlscredsx509 /qcrypto/tlscredsx509/badca3
PASS 9 test-crypto-tlscredsx509 /qcrypto/tlscredsx509/goodserver1
PASS 10 test-crypto-tlscredsx509 /qcrypto/tlscredsx509/goodserver2
==12103==WARNING: ASan doesn't fully support makecontext/swapcontext functions 
and may produce false positives in some cases!
PASS 3 ahci-test /x86_64/ahci/pci_enable
PASS 11 test-crypto-tlscredsx509 /qcrypto/tlscredsx509/goodserver3
PASS 12 test-crypto-tlscredsx509 /qcrypto/tlscredsx509/goodserver4
==12109==WARNING: ASan doesn't fully support makecontext/swapcontext functions 
and may produce false positives in some cases!
PASS 4 ahci-test /x86_64/ahci/hba_spec
PASS 13 test-crypto-tlscredsx509 /qcrypto/tlscredsx509/goodserver5
PASS 14 test-crypto-tlscredsx509 /qcrypto/tlscredsx509/goodserver6
==12115==WARNING: ASan doesn't fully support makecontext/swapcontext functions 
and may produce false positives in some cases!
PASS 5 ahci-test /x86_64/ahci/hba_enable
==12121==WARNING: ASan doesn't fully support makecontext/swapcontext functions 
and may produce false positives in some cases!
PASS 15 test-crypto-tlscredsx509 /qcrypto/tlscredsx509/goodserver7
PASS 16 test-crypto-tlscredsx509 /qcrypto/tlscredsx509/badserver1
PASS 6 ahci-test /x86_64/ahci/identify
---
PASS 37 test-crypto-tlscredsx509 /qcrypto/tlscredsx509/missingca
PASS 38 test-crypto-tlscredsx509 /qcrypto/tlscredsx509/missingserver
PASS 39 test-crypto-tlscredsx509 /qcrypto/tlscredsx509/missingclient
==12127==WARNING: ASan doesn't fully support makecontext/swapcontext functions 
and may produce false positives in some cases!
MALLOC_PERTURB_=${MALLOC_PERTURB_:-$(( ${RANDOM:-0} % 255 + 1))}  
tests/test-crypto-tlssession -m=quick -k --tap < /dev/null | 
./scripts/tap-driver.pl --test-name="test-crypto-tlssession" 
PASS 7 ahci-test /x86_64/ahci/max
==12137==WARNING: ASan doesn't fully support makecontext/swapcontext functions 
and may produce false positives in some cases!
PASS 1 test-crypto-tlssession /qcrypto/tlssession/psk
PASS 8 ahci-test /x86_64/ahci/reset
PASS 2 test-crypto-tlssession /qcrypto/tlssession/basicca
PASS 3 test-crypto-tlssession /qcrypto/tlssession/differentca
==12143==WARNING: ASan doesn't fully support makecontext/swapcontext functions 
and may produce false positives in some cases!
==12143==WARNING: ASan is ignoring requested __asan_handle_no_return: stack 
top: 0x7fffef155000; bottom 0x7f91de9fe000; size: 0x006e10757000 (472722534400)
False positive error reports may follow
For details see https://github.com/google/sanitizers/issues/189
PASS 4 test-crypto-tlssession /qcrypto/tlssession/altname1
PASS 9 ahci-test /x86_64/ahci/io/pio/lba28/simple/zero
==12149==WARNING: ASan doesn't fully support makecontext/swapcontext functions 
and may produce false positives in some cases!
==12149==WARNING: ASan is ignoring requested __asan_handle_no_return: stack 
top: 0x7ffca5063000; bottom 0x7f3a8fdfe000; size: 0x00c215265000 (833578487808)
False positive error reports may follow
For details see https://github.com/google/sanitizers/issues/189
PASS 10 ahci-test /x86_64/ahci/io/pio/lba28/simple/low
PASS 5 test-crypto-tlssession /qcrypto/tlssession/altname2
==12155==WARNING: ASan doesn't fully support makecontext/swapcontext functions 
and may produce false positives in some cases!
==12155==WARNING: ASan is ignoring requested __asan_handle_no_return: stack 
top: 0x7ffe94559000; bottom 0x7feaa49fe000; size: 0x0013efb5b000 (85626040320)
False positive error reports may follow
For details see https://github.com/google/sanitizers/issues/189
PASS 11 ahci-test /x86_64/ahci/io/pio/lba28/simple/high
PASS 6 test-crypto-tlssession /qcrypto/tlssession/altname3
==12161==WARNING: ASan doesn't fully support makecontext/swapcontext functions 
and may produce false positives in some cases!
==12161==WARNING: ASan is ignoring requested __asan_handle_no_return: stack 
top: 0x7ffc6ea4d000; bottom 0x7fcfe5bfe000; size: 0x002c88e4f000 (191275266048)
False positive error reports may follow
For details see https://github.com/google/sanitizers/issues/189
PASS 12 ahci-test /x86_64/ahci/io/pio/lba28/double/zero
==12167==WARNING: ASan doesn't fully support makecontext/swapcontext functions 
and may produce false positives in some cases!
==12167==WARNING: ASan is ignoring requested __asan_handle_no_return: stack 
top: 0x7ffceb489000; bottom 0x7f7ae03fe000; size: 0x00820b08b000 (558530867200)
False positive error reports may follow
For details see https://github.com/google/sanitizers/issues/189
PASS 13 ahci-test /x86_64/ahci/io/pio/lba28/double/low
PASS 7 test-crypto-tlssession /qcrypto/tlssession/altname4
==12173==WARNING: ASan doesn't fully support makecontext/swapcontext functions 
and may produce false positives in some cases!
==12173==WARNING: ASan is ignoring requested __asan_handle_no_return: stack 
top: 0x7ffea8116000; bottom 0x7ffa8d1fe000; size: 0x00041af18000 (17631903744)
False positive error reports may follow
For details see https://github.com/google/sanitizers/issues/189
PASS 8 test-crypto-tlssession /qcrypto/tlssession/altname5
PASS 9 test-crypto-tlssession /qcrypto/tlssession/altname6
PASS 14 ahci-test /x86_64/ahci/io/pio/lba28/double/high
==12179==WARNING: ASan doesn't fully support makecontext/swapcontext functions 
and may produce false positives in some cases!
PASS 10 test-crypto-tlssession /qcrypto/tlssession/wildcard1
==12179==WARNING: ASan is ignoring requested __asan_handle_no_return: stack 
top: 0x7ffcc92ea000; bottom 0x7fd04fd7c000; size: 0x002c7956e000 (191014297600)
False positive error reports may follow
For details see https://github.com/google/sanitizers/issues/189
PASS 11 test-crypto-tlssession /qcrypto/tlssession/wildcard2
PASS 15 ahci-test /x86_64/ahci/io/pio/lba28/long/zero
==12185==WARNING: ASan doesn't fully support makecontext/swapcontext functions 
and may produce false positives in some cases!
==12185==WARNING: ASan is ignoring requested __asan_handle_no_return: stack 
top: 0x7fffd04b8000; bottom 0x7f78d3524000; size: 0x0086fcf94000 (579769810944)
False positive error reports may follow
For details see https://github.com/google/sanitizers/issues/189
PASS 12 test-crypto-tlssession /qcrypto/tlssession/wildcard3
PASS 16 ahci-test /x86_64/ahci/io/pio/lba28/long/low
==12191==WARNING: ASan doesn't fully support makecontext/swapcontext functions 
and may produce false positives in some cases!
PASS 13 test-crypto-tlssession /qcrypto/tlssession/wildcard4
==12191==WARNING: ASan is ignoring requested __asan_handle_no_return: stack 
top: 0x7ffc38252000; bottom 0x7f307cdfe000; size: 0x00cbbb454000 (875020238848)
False positive error reports may follow
For details see https://github.com/google/sanitizers/issues/189
PASS 14 test-crypto-tlssession /qcrypto/tlssession/wildcard5
---
PASS 15 test-crypto-tlssession /qcrypto/tlssession/wildcard6
PASS 16 test-crypto-tlssession /qcrypto/tlssession/cachain
MALLOC_PERTURB_=${MALLOC_PERTURB_:-$(( ${RANDOM:-0} % 255 + 1))}  
tests/test-qga -m=quick -k --tap < /dev/null | ./scripts/tap-driver.pl 
--test-name="test-qga" 
==12197==WARNING: ASan doesn't fully support makecontext/swapcontext functions 
and may produce false positives in some cases!
PASS 18 ahci-test /x86_64/ahci/io/pio/lba28/short/zero
==12211==WARNING: ASan doesn't fully support makecontext/swapcontext functions 
and may produce false positives in some cases!
PASS 1 test-qga /qga/sync-delimited
PASS 2 test-qga /qga/sync
PASS 3 test-qga /qga/ping
---
PASS 15 test-qga /qga/invalid-cmd
PASS 16 test-qga /qga/invalid-args
PASS 17 test-qga /qga/fsfreeze-status
==12217==WARNING: ASan doesn't fully support makecontext/swapcontext functions 
and may produce false positives in some cases!
PASS 20 ahci-test /x86_64/ahci/io/pio/lba28/short/high
PASS 18 test-qga /qga/blacklist
PASS 19 test-qga /qga/config
PASS 20 test-qga /qga/guest-exec
PASS 21 test-qga /qga/guest-exec-invalid
==12226==WARNING: ASan doesn't fully support makecontext/swapcontext functions 
and may produce false positives in some cases!
==12226==WARNING: ASan is ignoring requested __asan_handle_no_return: stack 
top: 0x7ffee724e000; bottom 0x7f80f4dfe000; size: 0x007df2450000 (540935520256)
False positive error reports may follow
For details see https://github.com/google/sanitizers/issues/189
PASS 21 ahci-test /x86_64/ahci/io/pio/lba48/simple/zero
==12244==WARNING: ASan doesn't fully support makecontext/swapcontext functions 
and may produce false positives in some cases!
==12244==WARNING: ASan is ignoring requested __asan_handle_no_return: stack 
top: 0x7ffefcc97000; bottom 0x7f70559fe000; size: 0x008ea7299000 (612689874944)
False positive error reports may follow
For details see https://github.com/google/sanitizers/issues/189
PASS 22 test-qga /qga/guest-get-osinfo
---
PASS 22 ahci-test /x86_64/ahci/io/pio/lba48/simple/low
PASS 1 test-timed-average /timed-average/average
MALLOC_PERTURB_=${MALLOC_PERTURB_:-$(( ${RANDOM:-0} % 255 + 1))}  
tests/test-util-filemonitor -m=quick -k --tap < /dev/null | 
./scripts/tap-driver.pl --test-name="test-util-filemonitor" 
==12255==WARNING: ASan doesn't fully support makecontext/swapcontext functions 
and may produce false positives in some cases!
PASS 1 test-util-filemonitor /util/filemonitor
MALLOC_PERTURB_=${MALLOC_PERTURB_:-$(( ${RANDOM:-0} % 255 + 1))}  
tests/test-util-sockets -m=quick -k --tap < /dev/null | ./scripts/tap-driver.pl 
--test-name="test-util-sockets" 
==12255==WARNING: ASan is ignoring requested __asan_handle_no_return: stack 
top: 0x7ffeb9f75000; bottom 0x7efdd45fe000; size: 0x0100e5977000 (1103363534848)
False positive error reports may follow
For details see https://github.com/google/sanitizers/issues/189
PASS 1 test-util-sockets /util/socket/is-socket/bad
---
PASS 4 test-authz-listfile /auth/list/explicit/deny
PASS 5 test-authz-listfile /auth/list/explicit/allow
MALLOC_PERTURB_=${MALLOC_PERTURB_:-$(( ${RANDOM:-0} % 255 + 1))}  
tests/test-io-task -m=quick -k --tap < /dev/null | ./scripts/tap-driver.pl 
--test-name="test-io-task" 
==12273==WARNING: ASan doesn't fully support makecontext/swapcontext functions 
and may produce false positives in some cases!
PASS 1 test-io-task /crypto/task/complete
PASS 2 test-io-task /crypto/task/datafree
PASS 3 test-io-task /crypto/task/failure
PASS 4 test-io-task /crypto/task/thread_complete
PASS 5 test-io-task /crypto/task/thread_failure
MALLOC_PERTURB_=${MALLOC_PERTURB_:-$(( ${RANDOM:-0} % 255 + 1))}  
tests/test-io-channel-socket -m=quick -k --tap < /dev/null | 
./scripts/tap-driver.pl --test-name="test-io-channel-socket" 
==12273==WARNING: ASan is ignoring requested __asan_handle_no_return: stack 
top: 0x7fffad7ea000; bottom 0x7fd0c19fe000; size: 0x002eebdec000 (201525739520)
False positive error reports may follow
For details see https://github.com/google/sanitizers/issues/189
PASS 24 ahci-test /x86_64/ahci/io/pio/lba48/double/zero
---
PASS 4 test-io-channel-file /io/channel/pipe/sync
PASS 5 test-io-channel-file /io/channel/pipe/async
MALLOC_PERTURB_=${MALLOC_PERTURB_:-$(( ${RANDOM:-0} % 255 + 1))}  
tests/test-io-channel-tls -m=quick -k --tap < /dev/null | 
./scripts/tap-driver.pl --test-name="test-io-channel-tls" 
==12320==WARNING: ASan doesn't fully support makecontext/swapcontext functions 
and may produce false positives in some cases!
==12320==WARNING: ASan is ignoring requested __asan_handle_no_return: stack 
top: 0x7fff996c1000; bottom 0x7f1e521fe000; size: 0x00e1474c3000 (967563816960)
False positive error reports may follow
For details see https://github.com/google/sanitizers/issues/189
PASS 25 ahci-test /x86_64/ahci/io/pio/lba48/double/low
PASS 1 test-io-channel-tls /qio/channel/tls/basic
MALLOC_PERTURB_=${MALLOC_PERTURB_:-$(( ${RANDOM:-0} % 255 + 1))}  
tests/test-io-channel-command -m=quick -k --tap < /dev/null | 
./scripts/tap-driver.pl --test-name="test-io-channel-command" 
==12352==WARNING: ASan doesn't fully support makecontext/swapcontext functions 
and may produce false positives in some cases!
PASS 1 test-io-channel-command /io/channel/command/fifo/sync
PASS 2 test-io-channel-command /io/channel/command/fifo/async
PASS 3 test-io-channel-command /io/channel/command/echo/sync
PASS 4 test-io-channel-command /io/channel/command/echo/async
MALLOC_PERTURB_=${MALLOC_PERTURB_:-$(( ${RANDOM:-0} % 255 + 1))}  
tests/test-io-channel-buffer -m=quick -k --tap < /dev/null | 
./scripts/tap-driver.pl --test-name="test-io-channel-buffer" 
==12352==WARNING: ASan is ignoring requested __asan_handle_no_return: stack 
top: 0x7fff66d97000; bottom 0x7f9d5a9fe000; size: 0x00620c399000 (421111894016)
False positive error reports may follow
For details see https://github.com/google/sanitizers/issues/189
PASS 1 test-io-channel-buffer /io/channel/buf
---
PASS 17 test-crypto-pbkdf /crypto/pbkdf/nonrfc/sha384/iter1200
PASS 18 test-crypto-pbkdf /crypto/pbkdf/nonrfc/ripemd160/iter1200
MALLOC_PERTURB_=${MALLOC_PERTURB_:-$(( ${RANDOM:-0} % 255 + 1))}  
tests/test-crypto-ivgen -m=quick -k --tap < /dev/null | ./scripts/tap-driver.pl 
--test-name="test-crypto-ivgen" 
==12373==WARNING: ASan doesn't fully support makecontext/swapcontext functions 
and may produce false positives in some cases!
PASS 1 test-crypto-ivgen /crypto/ivgen/plain/1
PASS 2 test-crypto-ivgen /crypto/ivgen/plain/1f2e3d4c
PASS 3 test-crypto-ivgen /crypto/ivgen/plain/1f2e3d4c5b6a7988
---
PASS 8 test-crypto-ivgen /crypto/ivgen/essiv/1f2e3d4c
PASS 9 test-crypto-ivgen /crypto/ivgen/essiv/1f2e3d4c5b6a7988
MALLOC_PERTURB_=${MALLOC_PERTURB_:-$(( ${RANDOM:-0} % 255 + 1))}  
tests/test-crypto-afsplit -m=quick -k --tap < /dev/null | 
./scripts/tap-driver.pl --test-name="test-crypto-afsplit" 
==12373==WARNING: ASan is ignoring requested __asan_handle_no_return: stack 
top: 0x7ffded841000; bottom 0x7f0e29f7c000; size: 0x00efc38c5000 (1029777936384)
False positive error reports may follow
For details see https://github.com/google/sanitizers/issues/189
PASS 1 test-crypto-afsplit /crypto/afsplit/sha256/5
---
MALLOC_PERTURB_=${MALLOC_PERTURB_:-$(( ${RANDOM:-0} % 255 + 1))}  
tests/test-crypto-block -m=quick -k --tap < /dev/null | ./scripts/tap-driver.pl 
--test-name="test-crypto-block" 
PASS 1 test-crypto-block /crypto/block/qcow
MALLOC_PERTURB_=${MALLOC_PERTURB_:-$(( ${RANDOM:-0} % 255 + 1))}  
tests/test-logging -m=quick -k --tap < /dev/null | ./scripts/tap-driver.pl 
--test-name="test-logging" 
==12395==WARNING: ASan doesn't fully support makecontext/swapcontext functions 
and may produce false positives in some cases!
PASS 1 test-logging /logging/parse_range
PASS 2 test-logging /logging/parse_path
PASS 3 test-logging /logging/logfile_write_path
PASS 4 test-logging /logging/logfile_lock_path
MALLOC_PERTURB_=${MALLOC_PERTURB_:-$(( ${RANDOM:-0} % 255 + 1))}  
tests/test-replication -m=quick -k --tap < /dev/null | ./scripts/tap-driver.pl 
--test-name="test-replication" 
==12410==WARNING: ASan doesn't fully support makecontext/swapcontext functions 
and may produce false positives in some cases!
==12395==WARNING: ASan is ignoring requested __asan_handle_no_return: stack 
top: 0x7ffd21426000; bottom 0x7f75f417c000; size: 0x00872d2aa000 (580578353152)
False positive error reports may follow
For details see https://github.com/google/sanitizers/issues/189
PASS 1 test-replication /replication/primary/read
PASS 2 test-replication /replication/primary/write
PASS 28 ahci-test /x86_64/ahci/io/pio/lba48/long/low
==12414==WARNING: ASan doesn't fully support makecontext/swapcontext functions 
and may produce false positives in some cases!
==12414==WARNING: ASan is ignoring requested __asan_handle_no_return: stack 
top: 0x7ffe6593d000; bottom 0x7f470e57c000; size: 0x00b7573c1000 (787442569216)
False positive error reports may follow
For details see https://github.com/google/sanitizers/issues/189
PASS 3 test-replication /replication/primary/start
---
PASS 5 test-replication /replication/primary/do_checkpoint
PASS 6 test-replication /replication/primary/get_error_all
PASS 29 ahci-test /x86_64/ahci/io/pio/lba48/long/high
==12420==WARNING: ASan doesn't fully support makecontext/swapcontext functions 
and may produce false positives in some cases!
PASS 7 test-replication /replication/secondary/read
PASS 30 ahci-test /x86_64/ahci/io/pio/lba48/short/zero
==12426==WARNING: ASan doesn't fully support makecontext/swapcontext functions 
and may produce false positives in some cases!
PASS 8 test-replication /replication/secondary/write
PASS 31 ahci-test /x86_64/ahci/io/pio/lba48/short/low
==12432==WARNING: ASan doesn't fully support makecontext/swapcontext functions 
and may produce false positives in some cases!
PASS 32 ahci-test /x86_64/ahci/io/pio/lba48/short/high
==12438==WARNING: ASan doesn't fully support makecontext/swapcontext functions 
and may produce false positives in some cases!
PASS 33 ahci-test /x86_64/ahci/io/dma/lba28/fragmented
==12445==WARNING: ASan doesn't fully support makecontext/swapcontext functions 
and may produce false positives in some cases!
==12410==WARNING: ASan is ignoring requested __asan_handle_no_return: stack 
top: 0x7fff10e08000; bottom 0x7fc72279b000; size: 0x0037ee66d000 (240222916608)
False positive error reports may follow
For details see https://github.com/google/sanitizers/issues/189
PASS 9 test-replication /replication/secondary/start
PASS 34 ahci-test /x86_64/ahci/io/dma/lba28/retry
==12467==WARNING: ASan doesn't fully support makecontext/swapcontext functions 
and may produce false positives in some cases!
PASS 35 ahci-test /x86_64/ahci/io/dma/lba28/simple/zero
==12473==WARNING: ASan doesn't fully support makecontext/swapcontext functions 
and may produce false positives in some cases!
PASS 36 ahci-test /x86_64/ahci/io/dma/lba28/simple/low
==12479==WARNING: ASan doesn't fully support makecontext/swapcontext functions 
and may produce false positives in some cases!
PASS 37 ahci-test /x86_64/ahci/io/dma/lba28/simple/high
PASS 10 test-replication /replication/secondary/stop
==12485==WARNING: ASan doesn't fully support makecontext/swapcontext functions 
and may produce false positives in some cases!
PASS 38 ahci-test /x86_64/ahci/io/dma/lba28/double/zero
==12491==WARNING: ASan doesn't fully support makecontext/swapcontext functions 
and may produce false positives in some cases!
PASS 39 ahci-test /x86_64/ahci/io/dma/lba28/double/low
==12497==WARNING: ASan doesn't fully support makecontext/swapcontext functions 
and may produce false positives in some cases!
PASS 40 ahci-test /x86_64/ahci/io/dma/lba28/double/high
PASS 11 test-replication /replication/secondary/continuous_replication
==12503==WARNING: ASan doesn't fully support makecontext/swapcontext functions 
and may produce false positives in some cases!
==12503==WARNING: ASan is ignoring requested __asan_handle_no_return: stack 
top: 0x7ffe4868e000; bottom 0x7f5b5edfd000; size: 0x00a2e9891000 (699702775808)
False positive error reports may follow
For details see https://github.com/google/sanitizers/issues/189
PASS 41 ahci-test /x86_64/ahci/io/dma/lba28/long/zero
==12510==WARNING: ASan doesn't fully support makecontext/swapcontext functions 
and may produce false positives in some cases!
==12510==WARNING: ASan is ignoring requested __asan_handle_no_return: stack 
top: 0x7fff6e530000; bottom 0x7f69e317b000; size: 0x00958b3b5000 (642286047232)
False positive error reports may follow
For details see https://github.com/google/sanitizers/issues/189
PASS 12 test-replication /replication/secondary/do_checkpoint
PASS 42 ahci-test /x86_64/ahci/io/dma/lba28/long/low
==12517==WARNING: ASan doesn't fully support makecontext/swapcontext functions 
and may produce false positives in some cases!
PASS 13 test-replication /replication/secondary/get_error_all
==12517==WARNING: ASan is ignoring requested __asan_handle_no_return: stack 
top: 0x7ffd574f7000; bottom 0x7f38eb9fd000; size: 0x00c46bafa000 (843620261888)
False positive error reports may follow
For details see https://github.com/google/sanitizers/issues/189
MALLOC_PERTURB_=${MALLOC_PERTURB_:-$(( ${RANDOM:-0} % 255 + 1))}  
tests/test-bufferiszero -m=quick -k --tap < /dev/null | ./scripts/tap-driver.pl 
--test-name="test-bufferiszero" 
**
ERROR:/tmp/qemu-test/src/tests/test-bufferiszero.c:43:test_1: assertion failed: 
(buffer_is_zero(buffer + a, s))
PASS 43 ahci-test /x86_64/ahci/io/dma/lba28/long/high
ERROR - Bail out! ERROR:/tmp/qemu-test/src/tests/test-bufferiszero.c:43:test_1: 
assertion failed: (buffer_is_zero(buffer + a, s))
make: *** [/tmp/qemu-test/src/tests/Makefile.include:638: check-unit] Error 1
make: *** Waiting for unfinished jobs....
==12527==WARNING: ASan doesn't fully support makecontext/swapcontext functions 
and may produce false positives in some cases!
PASS 44 ahci-test /x86_64/ahci/io/dma/lba28/short/zero
==12533==WARNING: ASan doesn't fully support makecontext/swapcontext functions 
and may produce false positives in some cases!
PASS 45 ahci-test /x86_64/ahci/io/dma/lba28/short/low
==12539==WARNING: ASan doesn't fully support makecontext/swapcontext functions 
and may produce false positives in some cases!
PASS 46 ahci-test /x86_64/ahci/io/dma/lba28/short/high
==12545==WARNING: ASan doesn't fully support makecontext/swapcontext functions 
and may produce false positives in some cases!
PASS 47 ahci-test /x86_64/ahci/io/dma/lba48/simple/zero
==12551==WARNING: ASan doesn't fully support makecontext/swapcontext functions 
and may produce false positives in some cases!
PASS 48 ahci-test /x86_64/ahci/io/dma/lba48/simple/low
==12557==WARNING: ASan doesn't fully support makecontext/swapcontext functions 
and may produce false positives in some cases!
PASS 49 ahci-test /x86_64/ahci/io/dma/lba48/simple/high
==12563==WARNING: ASan doesn't fully support makecontext/swapcontext functions 
and may produce false positives in some cases!
PASS 50 ahci-test /x86_64/ahci/io/dma/lba48/double/zero
==12569==WARNING: ASan doesn't fully support makecontext/swapcontext functions 
and may produce false positives in some cases!
PASS 51 ahci-test /x86_64/ahci/io/dma/lba48/double/low
==12575==WARNING: ASan doesn't fully support makecontext/swapcontext functions 
and may produce false positives in some cases!
PASS 52 ahci-test /x86_64/ahci/io/dma/lba48/double/high
==12581==WARNING: ASan doesn't fully support makecontext/swapcontext functions 
and may produce false positives in some cases!
==12581==WARNING: ASan is ignoring requested __asan_handle_no_return: stack 
top: 0x7ffc90229000; bottom 0x7f7c67dfd000; size: 0x00802842c000 (550431277056)
False positive error reports may follow
For details see https://github.com/google/sanitizers/issues/189
PASS 53 ahci-test /x86_64/ahci/io/dma/lba48/long/zero
==12588==WARNING: ASan doesn't fully support makecontext/swapcontext functions 
and may produce false positives in some cases!
==12588==WARNING: ASan is ignoring requested __asan_handle_no_return: stack 
top: 0x7ffe12078000; bottom 0x7fbbcb9fd000; size: 0x00424667b000 (284649041920)
False positive error reports may follow
For details see https://github.com/google/sanitizers/issues/189
PASS 54 ahci-test /x86_64/ahci/io/dma/lba48/long/low
==12595==WARNING: ASan doesn't fully support makecontext/swapcontext functions 
and may produce false positives in some cases!
==12595==WARNING: ASan is ignoring requested __asan_handle_no_return: stack 
top: 0x7fffb71e4000; bottom 0x7f1368bfd000; size: 0x00ec4e5e7000 (1014927093760)
False positive error reports may follow
For details see https://github.com/google/sanitizers/issues/189
PASS 55 ahci-test /x86_64/ahci/io/dma/lba48/long/high
==12602==WARNING: ASan doesn't fully support makecontext/swapcontext functions 
and may produce false positives in some cases!
PASS 56 ahci-test /x86_64/ahci/io/dma/lba48/short/zero
==12608==WARNING: ASan doesn't fully support makecontext/swapcontext functions 
and may produce false positives in some cases!
PASS 57 ahci-test /x86_64/ahci/io/dma/lba48/short/low
==12614==WARNING: ASan doesn't fully support makecontext/swapcontext functions 
and may produce false positives in some cases!
PASS 58 ahci-test /x86_64/ahci/io/dma/lba48/short/high
==12620==WARNING: ASan doesn't fully support makecontext/swapcontext functions 
and may produce false positives in some cases!
PASS 59 ahci-test /x86_64/ahci/io/ncq/simple
==12626==WARNING: ASan doesn't fully support makecontext/swapcontext functions 
and may produce false positives in some cases!
PASS 60 ahci-test /x86_64/ahci/io/ncq/retry
==12632==WARNING: ASan doesn't fully support makecontext/swapcontext functions 
and may produce false positives in some cases!
PASS 61 ahci-test /x86_64/ahci/flush/simple
==12638==WARNING: ASan doesn't fully support makecontext/swapcontext functions 
and may produce false positives in some cases!
PASS 62 ahci-test /x86_64/ahci/flush/retry
==12644==WARNING: ASan doesn't fully support makecontext/swapcontext functions 
and may produce false positives in some cases!
==12650==WARNING: ASan doesn't fully support makecontext/swapcontext functions 
and may produce false positives in some cases!
PASS 63 ahci-test /x86_64/ahci/flush/migrate
==12658==WARNING: ASan doesn't fully support makecontext/swapcontext functions 
and may produce false positives in some cases!
==12664==WARNING: ASan doesn't fully support makecontext/swapcontext functions 
and may produce false positives in some cases!
PASS 64 ahci-test /x86_64/ahci/migrate/sanity
==12672==WARNING: ASan doesn't fully support makecontext/swapcontext functions 
and may produce false positives in some cases!
==12678==WARNING: ASan doesn't fully support makecontext/swapcontext functions 
and may produce false positives in some cases!
PASS 65 ahci-test /x86_64/ahci/migrate/dma/simple
==12686==WARNING: ASan doesn't fully support makecontext/swapcontext functions 
and may produce false positives in some cases!
==12692==WARNING: ASan doesn't fully support makecontext/swapcontext functions 
and may produce false positives in some cases!
PASS 66 ahci-test /x86_64/ahci/migrate/dma/halted
==12700==WARNING: ASan doesn't fully support makecontext/swapcontext functions 
and may produce false positives in some cases!
==12706==WARNING: ASan doesn't fully support makecontext/swapcontext functions 
and may produce false positives in some cases!
PASS 67 ahci-test /x86_64/ahci/migrate/ncq/simple
==12714==WARNING: ASan doesn't fully support makecontext/swapcontext functions 
and may produce false positives in some cases!
==12720==WARNING: ASan doesn't fully support makecontext/swapcontext functions 
and may produce false positives in some cases!
PASS 68 ahci-test /x86_64/ahci/migrate/ncq/halted
==12728==WARNING: ASan doesn't fully support makecontext/swapcontext functions 
and may produce false positives in some cases!
PASS 69 ahci-test /x86_64/ahci/cdrom/eject
==12733==WARNING: ASan doesn't fully support makecontext/swapcontext functions 
and may produce false positives in some cases!
PASS 70 ahci-test /x86_64/ahci/cdrom/dma/single
==12739==WARNING: ASan doesn't fully support makecontext/swapcontext functions 
and may produce false positives in some cases!
PASS 71 ahci-test /x86_64/ahci/cdrom/dma/multi
==12745==WARNING: ASan doesn't fully support makecontext/swapcontext functions 
and may produce false positives in some cases!
PASS 72 ahci-test /x86_64/ahci/cdrom/pio/single
==12751==WARNING: ASan doesn't fully support makecontext/swapcontext functions 
and may produce false positives in some cases!
==12751==WARNING: ASan is ignoring requested __asan_handle_no_return: stack 
top: 0x7fff1a489000; bottom 0x7f0d0a3fe000; size: 0x00f21008b000 (1039651090432)
False positive error reports may follow
For details see https://github.com/google/sanitizers/issues/189
PASS 73 ahci-test /x86_64/ahci/cdrom/pio/multi
==12757==WARNING: ASan doesn't fully support makecontext/swapcontext functions 
and may produce false positives in some cases!
PASS 74 ahci-test /x86_64/ahci/cdrom/pio/bcl
MALLOC_PERTURB_=${MALLOC_PERTURB_:-$(( ${RANDOM:-0} % 255 + 1))}  
QTEST_QEMU_BINARY=x86_64-softmmu/qemu-system-x86_64 QTEST_QEMU_IMG=qemu-img 
tests/qtest/hd-geo-test -m=quick -k --tap < /dev/null | ./scripts/tap-driver.pl 
--test-name="hd-geo-test" 
PASS 1 hd-geo-test /x86_64/hd-geo/ide/none
==12771==WARNING: ASan doesn't fully support makecontext/swapcontext functions 
and may produce false positives in some cases!
PASS 2 hd-geo-test /x86_64/hd-geo/ide/drive/cd_0
==12777==WARNING: ASan doesn't fully support makecontext/swapcontext functions 
and may produce false positives in some cases!
PASS 3 hd-geo-test /x86_64/hd-geo/ide/drive/mbr/blank
==12783==WARNING: ASan doesn't fully support makecontext/swapcontext functions 
and may produce false positives in some cases!
PASS 4 hd-geo-test /x86_64/hd-geo/ide/drive/mbr/lba
==12789==WARNING: ASan doesn't fully support makecontext/swapcontext functions 
and may produce false positives in some cases!
PASS 5 hd-geo-test /x86_64/hd-geo/ide/drive/mbr/chs
==12795==WARNING: ASan doesn't fully support makecontext/swapcontext functions 
and may produce false positives in some cases!
PASS 6 hd-geo-test /x86_64/hd-geo/ide/device/mbr/blank
==12801==WARNING: ASan doesn't fully support makecontext/swapcontext functions 
and may produce false positives in some cases!
PASS 7 hd-geo-test /x86_64/hd-geo/ide/device/mbr/lba
==12807==WARNING: ASan doesn't fully support makecontext/swapcontext functions 
and may produce false positives in some cases!
PASS 8 hd-geo-test /x86_64/hd-geo/ide/device/mbr/chs
==12813==WARNING: ASan doesn't fully support makecontext/swapcontext functions 
and may produce false positives in some cases!
PASS 9 hd-geo-test /x86_64/hd-geo/ide/device/user/chs
==12818==WARNING: ASan doesn't fully support makecontext/swapcontext functions 
and may produce false positives in some cases!
PASS 10 hd-geo-test /x86_64/hd-geo/ide/device/user/chst
==12824==WARNING: ASan doesn't fully support makecontext/swapcontext functions 
and may produce false positives in some cases!
==12828==WARNING: ASan doesn't fully support makecontext/swapcontext functions 
and may produce false positives in some cases!
==12832==WARNING: ASan doesn't fully support makecontext/swapcontext functions 
and may produce false positives in some cases!
==12836==WARNING: ASan doesn't fully support makecontext/swapcontext functions 
and may produce false positives in some cases!
==12840==WARNING: ASan doesn't fully support makecontext/swapcontext functions 
and may produce false positives in some cases!
==12844==WARNING: ASan doesn't fully support makecontext/swapcontext functions 
and may produce false positives in some cases!
==12848==WARNING: ASan doesn't fully support makecontext/swapcontext functions 
and may produce false positives in some cases!
==12852==WARNING: ASan doesn't fully support makecontext/swapcontext functions 
and may produce false positives in some cases!
==12855==WARNING: ASan doesn't fully support makecontext/swapcontext functions 
and may produce false positives in some cases!
PASS 11 hd-geo-test /x86_64/hd-geo/override/ide
==12862==WARNING: ASan doesn't fully support makecontext/swapcontext functions 
and may produce false positives in some cases!
==12866==WARNING: ASan doesn't fully support makecontext/swapcontext functions 
and may produce false positives in some cases!
==12870==WARNING: ASan doesn't fully support makecontext/swapcontext functions 
and may produce false positives in some cases!
==12874==WARNING: ASan doesn't fully support makecontext/swapcontext functions 
and may produce false positives in some cases!
==12878==WARNING: ASan doesn't fully support makecontext/swapcontext functions 
and may produce false positives in some cases!
==12882==WARNING: ASan doesn't fully support makecontext/swapcontext functions 
and may produce false positives in some cases!
==12886==WARNING: ASan doesn't fully support makecontext/swapcontext functions 
and may produce false positives in some cases!
==12890==WARNING: ASan doesn't fully support makecontext/swapcontext functions 
and may produce false positives in some cases!
==12893==WARNING: ASan doesn't fully support makecontext/swapcontext functions 
and may produce false positives in some cases!
PASS 12 hd-geo-test /x86_64/hd-geo/override/scsi
==12900==WARNING: ASan doesn't fully support makecontext/swapcontext functions 
and may produce false positives in some cases!
==12904==WARNING: ASan doesn't fully support makecontext/swapcontext functions 
and may produce false positives in some cases!
==12908==WARNING: ASan doesn't fully support makecontext/swapcontext functions 
and may produce false positives in some cases!
==12912==WARNING: ASan doesn't fully support makecontext/swapcontext functions 
and may produce false positives in some cases!
==12916==WARNING: ASan doesn't fully support makecontext/swapcontext functions 
and may produce false positives in some cases!
==12920==WARNING: ASan doesn't fully support makecontext/swapcontext functions 
and may produce false positives in some cases!
==12924==WARNING: ASan doesn't fully support makecontext/swapcontext functions 
and may produce false positives in some cases!
==12928==WARNING: ASan doesn't fully support makecontext/swapcontext functions 
and may produce false positives in some cases!
==12931==WARNING: ASan doesn't fully support makecontext/swapcontext functions 
and may produce false positives in some cases!
PASS 13 hd-geo-test /x86_64/hd-geo/override/scsi_2_controllers
==12938==WARNING: ASan doesn't fully support makecontext/swapcontext functions 
and may produce false positives in some cases!
==12942==WARNING: ASan doesn't fully support makecontext/swapcontext functions 
and may produce false positives in some cases!
==12946==WARNING: ASan doesn't fully support makecontext/swapcontext functions 
and may produce false positives in some cases!
==12950==WARNING: ASan doesn't fully support makecontext/swapcontext functions 
and may produce false positives in some cases!
==12953==WARNING: ASan doesn't fully support makecontext/swapcontext functions 
and may produce false positives in some cases!
PASS 14 hd-geo-test /x86_64/hd-geo/override/virtio_blk
==12960==WARNING: ASan doesn't fully support makecontext/swapcontext functions 
and may produce false positives in some cases!
==12964==WARNING: ASan doesn't fully support makecontext/swapcontext functions 
and may produce false positives in some cases!
==12967==WARNING: ASan doesn't fully support makecontext/swapcontext functions 
and may produce false positives in some cases!
PASS 15 hd-geo-test /x86_64/hd-geo/override/zero_chs
==12974==WARNING: ASan doesn't fully support makecontext/swapcontext functions 
and may produce false positives in some cases!
==12978==WARNING: ASan doesn't fully support makecontext/swapcontext functions 
and may produce false positives in some cases!
==12982==WARNING: ASan doesn't fully support makecontext/swapcontext functions 
and may produce false positives in some cases!
==12986==WARNING: ASan doesn't fully support makecontext/swapcontext functions 
and may produce false positives in some cases!
==12989==WARNING: ASan doesn't fully support makecontext/swapcontext functions 
and may produce false positives in some cases!
PASS 16 hd-geo-test /x86_64/hd-geo/override/scsi_hot_unplug
==12996==WARNING: ASan doesn't fully support makecontext/swapcontext functions 
and may produce false positives in some cases!
==13000==WARNING: ASan doesn't fully support makecontext/swapcontext functions 
and may produce false positives in some cases!
==13004==WARNING: ASan doesn't fully support makecontext/swapcontext functions 
and may produce false positives in some cases!
==13008==WARNING: ASan doesn't fully support makecontext/swapcontext functions 
and may produce false positives in some cases!
==13011==WARNING: ASan doesn't fully support makecontext/swapcontext functions 
and may produce false positives in some cases!
PASS 17 hd-geo-test /x86_64/hd-geo/override/virtio_hot_unplug
MALLOC_PERTURB_=${MALLOC_PERTURB_:-$(( ${RANDOM:-0} % 255 + 1))}  
QTEST_QEMU_BINARY=x86_64-softmmu/qemu-system-x86_64 QTEST_QEMU_IMG=qemu-img 
tests/qtest/boot-order-test -m=quick -k --tap < /dev/null | 
./scripts/tap-driver.pl --test-name="boot-order-test" 
PASS 1 boot-order-test /x86_64/boot-order/pc
---
Could not access KVM kernel module: No such file or directory
qemu-system-x86_64: -accel kvm: failed to initialize kvm: No such file or 
directory
qemu-system-x86_64: falling back to tcg
==13080==WARNING: ASan doesn't fully support makecontext/swapcontext functions 
and may produce false positives in some cases!

Looking for expected file 'tests/data/acpi/pc/FACP'
Using expected file 'tests/data/acpi/pc/FACP'
---
Could not access KVM kernel module: No such file or directory
qemu-system-x86_64: -accel kvm: failed to initialize kvm: No such file or 
directory
qemu-system-x86_64: falling back to tcg
==13086==WARNING: ASan doesn't fully support makecontext/swapcontext functions 
and may produce false positives in some cases!

Looking for expected file 'tests/data/acpi/q35/FACP'
Using expected file 'tests/data/acpi/q35/FACP'
---
Could not access KVM kernel module: No such file or directory
qemu-system-x86_64: -accel kvm: failed to initialize kvm: No such file or 
directory
qemu-system-x86_64: falling back to tcg
==13092==WARNING: ASan doesn't fully support makecontext/swapcontext functions 
and may produce false positives in some cases!

Looking for expected file 'tests/data/acpi/pc/FACP.bridge'
Looking for expected file 'tests/data/acpi/pc/FACP'
---
Could not access KVM kernel module: No such file or directory
qemu-system-x86_64: -accel kvm: failed to initialize kvm: No such file or 
directory
qemu-system-x86_64: falling back to tcg
==13098==WARNING: ASan doesn't fully support makecontext/swapcontext functions 
and may produce false positives in some cases!

Looking for expected file 'tests/data/acpi/pc/FACP.ipmikcs'
Looking for expected file 'tests/data/acpi/pc/FACP'
---
Could not access KVM kernel module: No such file or directory
qemu-system-x86_64: -accel kvm: failed to initialize kvm: No such file or 
directory
qemu-system-x86_64: falling back to tcg
==13104==WARNING: ASan doesn't fully support makecontext/swapcontext functions 
and may produce false positives in some cases!

Looking for expected file 'tests/data/acpi/pc/FACP.cphp'
Looking for expected file 'tests/data/acpi/pc/FACP'
---
Could not access KVM kernel module: No such file or directory
qemu-system-x86_64: -accel kvm: failed to initialize kvm: No such file or 
directory
qemu-system-x86_64: falling back to tcg
==13111==WARNING: ASan doesn't fully support makecontext/swapcontext functions 
and may produce false positives in some cases!

Looking for expected file 'tests/data/acpi/pc/FACP.memhp'
Looking for expected file 'tests/data/acpi/pc/FACP'
---
Could not access KVM kernel module: No such file or directory
qemu-system-x86_64: -accel kvm: failed to initialize kvm: No such file or 
directory
qemu-system-x86_64: falling back to tcg
==13117==WARNING: ASan doesn't fully support makecontext/swapcontext functions 
and may produce false positives in some cases!

Looking for expected file 'tests/data/acpi/pc/FACP.numamem'
Looking for expected file 'tests/data/acpi/pc/FACP'
---
Could not access KVM kernel module: No such file or directory
qemu-system-x86_64: -accel kvm: failed to initialize kvm: No such file or 
directory
qemu-system-x86_64: falling back to tcg
==13123==WARNING: ASan doesn't fully support makecontext/swapcontext functions 
and may produce false positives in some cases!

Looking for expected file 'tests/data/acpi/pc/FACP.dimmpxm'
Looking for expected file 'tests/data/acpi/pc/FACP'
---
Could not access KVM kernel module: No such file or directory
qemu-system-x86_64: -accel kvm: failed to initialize kvm: No such file or 
directory
qemu-system-x86_64: falling back to tcg
==13132==WARNING: ASan doesn't fully support makecontext/swapcontext functions 
and may produce false positives in some cases!

Looking for expected file 'tests/data/acpi/pc/FACP.acpihmat'
Looking for expected file 'tests/data/acpi/pc/FACP'
---
Could not access KVM kernel module: No such file or directory
qemu-system-x86_64: -accel kvm: failed to initialize kvm: No such file or 
directory
qemu-system-x86_64: falling back to tcg
==13139==WARNING: ASan doesn't fully support makecontext/swapcontext functions 
and may produce false positives in some cases!

Looking for expected file 'tests/data/acpi/q35/FACP.bridge'
Looking for expected file 'tests/data/acpi/q35/FACP'
---
Could not access KVM kernel module: No such file or directory
qemu-system-x86_64: -accel kvm: failed to initialize kvm: No such file or 
directory
qemu-system-x86_64: falling back to tcg
==13145==WARNING: ASan doesn't fully support makecontext/swapcontext functions 
and may produce false positives in some cases!

Looking for expected file 'tests/data/acpi/q35/FACP.mmio64'
Looking for expected file 'tests/data/acpi/q35/FACP'
---
Could not access KVM kernel module: No such file or directory
qemu-system-x86_64: -accel kvm: failed to initialize kvm: No such file or 
directory
qemu-system-x86_64: falling back to tcg
==13151==WARNING: ASan doesn't fully support makecontext/swapcontext functions 
and may produce false positives in some cases!

Looking for expected file 'tests/data/acpi/q35/FACP.ipmibt'
Looking for expected file 'tests/data/acpi/q35/FACP'
---
Could not access KVM kernel module: No such file or directory
qemu-system-x86_64: -accel kvm: failed to initialize kvm: No such file or 
directory
qemu-system-x86_64: falling back to tcg
==13157==WARNING: ASan doesn't fully support makecontext/swapcontext functions 
and may produce false positives in some cases!

Looking for expected file 'tests/data/acpi/q35/FACP.cphp'
Looking for expected file 'tests/data/acpi/q35/FACP'
---
Could not access KVM kernel module: No such file or directory
qemu-system-x86_64: -accel kvm: failed to initialize kvm: No such file or 
directory
qemu-system-x86_64: falling back to tcg
==13164==WARNING: ASan doesn't fully support makecontext/swapcontext functions 
and may produce false positives in some cases!

Looking for expected file 'tests/data/acpi/q35/FACP.memhp'
Looking for expected file 'tests/data/acpi/q35/FACP'
---
Could not access KVM kernel module: No such file or directory
qemu-system-x86_64: -accel kvm: failed to initialize kvm: No such file or 
directory
qemu-system-x86_64: falling back to tcg
==13170==WARNING: ASan doesn't fully support makecontext/swapcontext functions 
and may produce false positives in some cases!

Looking for expected file 'tests/data/acpi/q35/FACP.numamem'
Looking for expected file 'tests/data/acpi/q35/FACP'
---
Could not access KVM kernel module: No such file or directory
qemu-system-x86_64: -accel kvm: failed to initialize kvm: No such file or 
directory
qemu-system-x86_64: falling back to tcg
==13176==WARNING: ASan doesn't fully support makecontext/swapcontext functions 
and may produce false positives in some cases!

Looking for expected file 'tests/data/acpi/q35/FACP.dimmpxm'
Looking for expected file 'tests/data/acpi/q35/FACP'
---
Could not access KVM kernel module: No such file or directory
qemu-system-x86_64: -accel kvm: failed to initialize kvm: No such file or 
directory
qemu-system-x86_64: falling back to tcg
==13185==WARNING: ASan doesn't fully support makecontext/swapcontext functions 
and may produce false positives in some cases!

Looking for expected file 'tests/data/acpi/q35/FACP.acpihmat'
Looking for expected file 'tests/data/acpi/q35/FACP'
---
PASS 1 i440fx-test /x86_64/i440fx/defaults
PASS 2 i440fx-test /x86_64/i440fx/pam
PASS 3 i440fx-test /x86_64/i440fx/firmware/bios
==13277==WARNING: ASan doesn't fully support makecontext/swapcontext functions 
and may produce false positives in some cases!
PASS 4 i440fx-test /x86_64/i440fx/firmware/pflash
MALLOC_PERTURB_=${MALLOC_PERTURB_:-$(( ${RANDOM:-0} % 255 + 1))}  
QTEST_QEMU_BINARY=x86_64-softmmu/qemu-system-x86_64 QTEST_QEMU_IMG=qemu-img 
tests/qtest/fw_cfg-test -m=quick -k --tap < /dev/null | ./scripts/tap-driver.pl 
--test-name="fw_cfg-test" 
PASS 1 fw_cfg-test /x86_64/fw_cfg/signature
---
MALLOC_PERTURB_=${MALLOC_PERTURB_:-$(( ${RANDOM:-0} % 255 + 1))}  
QTEST_QEMU_BINARY=x86_64-softmmu/qemu-system-x86_64 QTEST_QEMU_IMG=qemu-img 
tests/qtest/drive_del-test -m=quick -k --tap < /dev/null | 
./scripts/tap-driver.pl --test-name="drive_del-test" 
PASS 1 drive_del-test /x86_64/drive_del/without-dev
PASS 2 drive_del-test /x86_64/drive_del/after_failed_device_add
==13370==WARNING: ASan doesn't fully support makecontext/swapcontext functions 
and may produce false positives in some cases!
PASS 3 drive_del-test /x86_64/blockdev/drive_del_device_del
MALLOC_PERTURB_=${MALLOC_PERTURB_:-$(( ${RANDOM:-0} % 255 + 1))}  
QTEST_QEMU_BINARY=x86_64-softmmu/qemu-system-x86_64 QTEST_QEMU_IMG=qemu-img 
tests/qtest/wdt_ib700-test -m=quick -k --tap < /dev/null | 
./scripts/tap-driver.pl --test-name="wdt_ib700-test" 
PASS 1 wdt_ib700-test /x86_64/wdt_ib700/pause
---
PASS 1 usb-hcd-uhci-test /x86_64/uhci/pci/init
PASS 2 usb-hcd-uhci-test /x86_64/uhci/pci/port1
PASS 3 usb-hcd-uhci-test /x86_64/uhci/pci/hotplug
==13565==WARNING: ASan doesn't fully support makecontext/swapcontext functions 
and may produce false positives in some cases!
PASS 4 usb-hcd-uhci-test /x86_64/uhci/pci/hotplug/usb-storage
MALLOC_PERTURB_=${MALLOC_PERTURB_:-$(( ${RANDOM:-0} % 255 + 1))}  
QTEST_QEMU_BINARY=x86_64-softmmu/qemu-system-x86_64 QTEST_QEMU_IMG=qemu-img 
tests/qtest/usb-hcd-ehci-test -m=quick -k --tap < /dev/null | 
./scripts/tap-driver.pl --test-name="usb-hcd-ehci-test" 
PASS 1 usb-hcd-ehci-test /x86_64/ehci/pci/uhci-port-1
---
MALLOC_PERTURB_=${MALLOC_PERTURB_:-$(( ${RANDOM:-0} % 255 + 1))}  
QTEST_QEMU_BINARY=x86_64-softmmu/qemu-system-x86_64 QTEST_QEMU_IMG=qemu-img 
tests/qtest/usb-hcd-xhci-test -m=quick -k --tap < /dev/null | 
./scripts/tap-driver.pl --test-name="usb-hcd-xhci-test" 
PASS 1 usb-hcd-xhci-test /x86_64/xhci/pci/init
PASS 2 usb-hcd-xhci-test /x86_64/xhci/pci/hotplug
==13583==WARNING: ASan doesn't fully support makecontext/swapcontext functions 
and may produce false positives in some cases!
PASS 3 usb-hcd-xhci-test /x86_64/xhci/pci/hotplug/usb-uas
PASS 4 usb-hcd-xhci-test /x86_64/xhci/pci/hotplug/usb-ccid
MALLOC_PERTURB_=${MALLOC_PERTURB_:-$(( ${RANDOM:-0} % 255 + 1))}  
QTEST_QEMU_BINARY=x86_64-softmmu/qemu-system-x86_64 QTEST_QEMU_IMG=qemu-img 
tests/qtest/cpu-plug-test -m=quick -k --tap < /dev/null | 
./scripts/tap-driver.pl --test-name="cpu-plug-test" 
---
Could not access KVM kernel module: No such file or directory
qemu-system-x86_64: -accel kvm: failed to initialize kvm: No such file or 
directory
qemu-system-x86_64: falling back to tcg
==13719==WARNING: ASan doesn't fully support makecontext/swapcontext functions 
and may produce false positives in some cases!
PASS 1 vmgenid-test /x86_64/vmgenid/vmgenid/set-guid
Could not access KVM kernel module: No such file or directory
qemu-system-x86_64: -accel kvm: failed to initialize kvm: No such file or 
directory
qemu-system-x86_64: falling back to tcg
==13725==WARNING: ASan doesn't fully support makecontext/swapcontext functions 
and may produce false positives in some cases!
PASS 2 vmgenid-test /x86_64/vmgenid/vmgenid/set-guid-auto
Could not access KVM kernel module: No such file or directory
qemu-system-x86_64: -accel kvm: failed to initialize kvm: No such file or 
directory
qemu-system-x86_64: falling back to tcg
==13731==WARNING: ASan doesn't fully support makecontext/swapcontext functions 
and may produce false positives in some cases!
PASS 3 vmgenid-test /x86_64/vmgenid/vmgenid/query-monitor
MALLOC_PERTURB_=${MALLOC_PERTURB_:-$(( ${RANDOM:-0} % 255 + 1))}  
QTEST_QEMU_BINARY=x86_64-softmmu/qemu-system-x86_64 QTEST_QEMU_IMG=qemu-img 
tests/qtest/tpm-crb-swtpm-test -m=quick -k --tap < /dev/null | 
./scripts/tap-driver.pl --test-name="tpm-crb-swtpm-test" 
SKIP 1 tpm-crb-swtpm-test /x86_64/tpm/crb-swtpm/test # SKIP swtpm not in PATH 
or missing --tpm2 support
---
Could not access KVM kernel module: No such file or directory
qemu-system-x86_64: -accel kvm: failed to initialize kvm: No such file or 
directory
qemu-system-x86_64: falling back to tcg
==13830==WARNING: ASan doesn't fully support makecontext/swapcontext functions 
and may produce false positives in some cases!
Could not access KVM kernel module: No such file or directory
qemu-system-x86_64: -accel kvm: failed to initialize kvm: No such file or 
directory
qemu-system-x86_64: falling back to tcg
==13836==WARNING: ASan doesn't fully support makecontext/swapcontext functions 
and may produce false positives in some cases!
PASS 3 migration-test /x86_64/migration/fd_proto
Could not access KVM kernel module: No such file or directory
qemu-system-x86_64: -accel kvm: failed to initialize kvm: No such file or 
directory
qemu-system-x86_64: falling back to tcg
==13843==WARNING: ASan doesn't fully support makecontext/swapcontext functions 
and may produce false positives in some cases!
Could not access KVM kernel module: No such file or directory
qemu-system-x86_64: -accel kvm: failed to initialize kvm: No such file or 
directory
qemu-system-x86_64: falling back to tcg
==13849==WARNING: ASan doesn't fully support makecontext/swapcontext functions 
and may produce false positives in some cases!
PASS 4 migration-test /x86_64/migration/validate_uuid
PASS 5 migration-test /x86_64/migration/validate_uuid_error
PASS 6 migration-test /x86_64/migration/validate_uuid_src_not_set
---
Could not access KVM kernel module: No such file or directory
qemu-system-x86_64: -accel kvm: failed to initialize kvm: No such file or 
directory
qemu-system-x86_64: falling back to tcg
==13899==WARNING: ASan doesn't fully support makecontext/swapcontext functions 
and may produce false positives in some cases!
Could not access KVM kernel module: No such file or directory
qemu-system-x86_64: -accel kvm: failed to initialize kvm: No such file or 
directory
qemu-system-x86_64: falling back to tcg
==13905==WARNING: ASan doesn't fully support makecontext/swapcontext functions 
and may produce false positives in some cases!
PASS 8 migration-test /x86_64/migration/auto_converge
Could not access KVM kernel module: No such file or directory
qemu-system-x86_64: -accel kvm: failed to initialize kvm: No such file or 
directory
qemu-system-x86_64: falling back to tcg
==13913==WARNING: ASan doesn't fully support makecontext/swapcontext functions 
and may produce false positives in some cases!
Could not access KVM kernel module: No such file or directory
qemu-system-x86_64: -accel kvm: failed to initialize kvm: No such file or 
directory
qemu-system-x86_64: falling back to tcg
==13919==WARNING: ASan doesn't fully support makecontext/swapcontext functions 
and may produce false positives in some cases!
PASS 9 migration-test /x86_64/migration/postcopy/unix
PASS 10 migration-test /x86_64/migration/postcopy/recovery
Could not access KVM kernel module: No such file or directory
qemu-system-x86_64: -accel kvm: failed to initialize kvm: No such file or 
directory
qemu-system-x86_64: falling back to tcg
==13948==WARNING: ASan doesn't fully support makecontext/swapcontext functions 
and may produce false positives in some cases!
Could not access KVM kernel module: No such file or directory
qemu-system-x86_64: -accel kvm: failed to initialize kvm: No such file or 
directory
qemu-system-x86_64: falling back to tcg
==13954==WARNING: ASan doesn't fully support makecontext/swapcontext functions 
and may produce false positives in some cases!
PASS 11 migration-test /x86_64/migration/precopy/unix
Could not access KVM kernel module: No such file or directory
qemu-system-x86_64: -accel kvm: failed to initialize kvm: No such file or 
directory
qemu-system-x86_64: falling back to tcg
==13962==WARNING: ASan doesn't fully support makecontext/swapcontext functions 
and may produce false positives in some cases!
Could not access KVM kernel module: No such file or directory
qemu-system-x86_64: -accel kvm: failed to initialize kvm: No such file or 
directory
qemu-system-x86_64: falling back to tcg
==13968==WARNING: ASan doesn't fully support makecontext/swapcontext functions 
and may produce false positives in some cases!
PASS 12 migration-test /x86_64/migration/precopy/tcp
Could not access KVM kernel module: No such file or directory
qemu-system-x86_64: -accel kvm: failed to initialize kvm: No such file or 
directory
qemu-system-x86_64: falling back to tcg
==13976==WARNING: ASan doesn't fully support makecontext/swapcontext functions 
and may produce false positives in some cases!
Could not access KVM kernel module: No such file or directory
qemu-system-x86_64: -accel kvm: failed to initialize kvm: No such file or 
directory
qemu-system-x86_64: falling back to tcg
==13982==WARNING: ASan doesn't fully support makecontext/swapcontext functions 
and may produce false positives in some cases!
PASS 13 migration-test /x86_64/migration/xbzrle/unix
Could not access KVM kernel module: No such file or directory
qemu-system-x86_64: -accel kvm: failed to initialize kvm: No such file or 
directory
qemu-system-x86_64: falling back to tcg
==13990==WARNING: ASan doesn't fully support makecontext/swapcontext functions 
and may produce false positives in some cases!
Could not access KVM kernel module: No such file or directory
qemu-system-x86_64: -accel kvm: failed to initialize kvm: No such file or 
directory
qemu-system-x86_64: falling back to tcg
==13996==WARNING: ASan doesn't fully support makecontext/swapcontext functions 
and may produce false positives in some cases!
PASS 14 migration-test /x86_64/migration/multifd/tcp/none
Could not access KVM kernel module: No such file or directory
qemu-system-x86_64: -accel kvm: failed to initialize kvm: No such file or 
directory
qemu-system-x86_64: falling back to tcg
==14114==WARNING: ASan doesn't fully support makecontext/swapcontext functions 
and may produce false positives in some cases!
PASS 15 migration-test /x86_64/migration/multifd/tcp/cancel
Could not access KVM kernel module: No such file or directory
qemu-system-x86_64: -accel kvm: failed to initialize kvm: No such file or 
directory
qemu-system-x86_64: falling back to tcg
==14170==WARNING: ASan doesn't fully support makecontext/swapcontext functions 
and may produce false positives in some cases!
Could not access KVM kernel module: No such file or directory
qemu-system-x86_64: -accel kvm: failed to initialize kvm: No such file or 
directory
qemu-system-x86_64: falling back to tcg
==14176==WARNING: ASan doesn't fully support makecontext/swapcontext functions 
and may produce false positives in some cases!
PASS 16 migration-test /x86_64/migration/multifd/tcp/zlib
Could not access KVM kernel module: No such file or directory
qemu-system-x86_64: -accel kvm: failed to initialize kvm: No such file or 
directory
qemu-system-x86_64: falling back to tcg
==14232==WARNING: ASan doesn't fully support makecontext/swapcontext functions 
and may produce false positives in some cases!
Could not access KVM kernel module: No such file or directory
qemu-system-x86_64: -accel kvm: failed to initialize kvm: No such file or 
directory
qemu-system-x86_64: falling back to tcg
==14238==WARNING: ASan doesn't fully support makecontext/swapcontext functions 
and may produce false positives in some cases!
PASS 17 migration-test /x86_64/migration/multifd/tcp/zstd
MALLOC_PERTURB_=${MALLOC_PERTURB_:-$(( ${RANDOM:-0} % 255 + 1))}  
QTEST_QEMU_BINARY=x86_64-softmmu/qemu-system-x86_64 QTEST_QEMU_IMG=qemu-img 
tests/qtest/test-x86-cpuid-compat -m=quick -k --tap < /dev/null | 
./scripts/tap-driver.pl --test-name="test-x86-cpuid-compat" 
PASS 1 test-x86-cpuid-compat /x86/cpuid/parsing-plus-minus
---
PASS 1 machine-none-test /x86_64/machine/none/cpu_option
MALLOC_PERTURB_=${MALLOC_PERTURB_:-$(( ${RANDOM:-0} % 255 + 1))}  
QTEST_QEMU_BINARY=x86_64-softmmu/qemu-system-x86_64 QTEST_QEMU_IMG=qemu-img 
tests/qtest/qmp-test -m=quick -k --tap < /dev/null | ./scripts/tap-driver.pl 
--test-name="qmp-test" 
PASS 1 qmp-test /x86_64/qmp/protocol
==14676==WARNING: ASan doesn't fully support makecontext/swapcontext functions 
and may produce false positives in some cases!
PASS 2 qmp-test /x86_64/qmp/oob
PASS 3 qmp-test /x86_64/qmp/preconfig
PASS 4 qmp-test /x86_64/qmp/missing-any-arg
---
PASS 16 qos-test 
/x86_64/pc/i440FX-pcihost/pci-bus-pc/pci-bus/i82562/pci-device/pci-device-tests/nop
PASS 17 qos-test 
/x86_64/pc/i440FX-pcihost/pci-bus-pc/pci-bus/i82801/pci-device/pci-device-tests/nop
PASS 18 qos-test 
/x86_64/pc/i440FX-pcihost/pci-bus-pc/pci-bus/ES1370/pci-device/pci-device-tests/nop
==15094==WARNING: ASan doesn't fully support makecontext/swapcontext functions 
and may produce false positives in some cases!
PASS 19 qos-test 
/x86_64/pc/i440FX-pcihost/pci-bus-pc/pci-bus/megasas/pci-device/pci-device-tests/nop
PASS 20 qos-test 
/x86_64/pc/i440FX-pcihost/pci-bus-pc/pci-bus/megasas/megasas-tests/dcmd/pd-get-info/fuzz
PASS 21 qos-test 
/x86_64/pc/i440FX-pcihost/pci-bus-pc/pci-bus/ne2k_pci/pci-device/pci-device-tests/nop
PASS 22 qos-test 
/x86_64/pc/i440FX-pcihost/pci-bus-pc/pci-bus/nvme/pci-device/pci-device-tests/nop
==15104==WARNING: ASan doesn't fully support makecontext/swapcontext functions 
and may produce false positives in some cases!
PASS 23 qos-test 
/x86_64/pc/i440FX-pcihost/pci-bus-pc/pci-bus/nvme/nvme-tests/oob-cmb-access
==15109==WARNING: ASan doesn't fully support makecontext/swapcontext functions 
and may produce false positives in some cases!
PASS 24 qos-test 
/x86_64/pc/i440FX-pcihost/pci-bus-pc/pci-bus/pcnet/pci-device/pci-device-tests/nop
PASS 25 qos-test 
/x86_64/pc/i440FX-pcihost/pci-bus-pc/pci-bus/pci-ohci/pci-device/pci-device-tests/nop
PASS 26 qos-test 
/x86_64/pc/i440FX-pcihost/pci-bus-pc/pci-bus/pci-ohci/pci-ohci-tests/ohci_pci-test-hotplug
---
PASS 33 qos-test 
/x86_64/pc/i440FX-pcihost/pci-bus-pc/pci-bus/sdhci-pci/sdhci/sdhci-tests/registers
PASS 34 qos-test 
/x86_64/pc/i440FX-pcihost/pci-bus-pc/pci-bus/tpci200/ipack/ipoctal232/ipoctal232-tests/nop
PASS 35 qos-test 
/x86_64/pc/i440FX-pcihost/pci-bus-pc/pci-bus/tpci200/pci-device/pci-device-tests/nop
==15169==WARNING: ASan doesn't fully support makecontext/swapcontext functions 
and may produce false positives in some cases!
PASS 36 qos-test 
/x86_64/pc/i440FX-pcihost/pci-bus-pc/pci-bus/virtio-9p-pci/pci-device/pci-device-tests/nop
PASS 37 qos-test 
/x86_64/pc/i440FX-pcihost/pci-bus-pc/pci-bus/virtio-9p-pci/virtio/virtio-tests/nop
PASS 38 qos-test 
/x86_64/pc/i440FX-pcihost/pci-bus-pc/pci-bus/virtio-9p-pci/virtio-9p/virtio-9p-tests/config
---
PASS 48 qos-test 
/x86_64/pc/i440FX-pcihost/pci-bus-pc/pci-bus/virtio-9p-pci/virtio-9p/virtio-9p-tests/fs/readdir/basic
PASS 49 qos-test 
/x86_64/pc/i440FX-pcihost/pci-bus-pc/pci-bus/virtio-balloon-pci/pci-device/pci-device-tests/nop
PASS 50 qos-test 
/x86_64/pc/i440FX-pcihost/pci-bus-pc/pci-bus/virtio-balloon-pci/virtio/virtio-tests/nop
==15180==WARNING: ASan doesn't fully support makecontext/swapcontext functions 
and may produce false positives in some cases!
PASS 51 qos-test 
/x86_64/pc/i440FX-pcihost/pci-bus-pc/pci-bus/virtio-blk-pci/virtio-blk-pci-tests/msix
==15186==WARNING: ASan doesn't fully support makecontext/swapcontext functions 
and may produce false positives in some cases!
PASS 52 qos-test 
/x86_64/pc/i440FX-pcihost/pci-bus-pc/pci-bus/virtio-blk-pci/virtio-blk-pci-tests/idx
==15192==WARNING: ASan doesn't fully support makecontext/swapcontext functions 
and may produce false positives in some cases!
PASS 53 qos-test 
/x86_64/pc/i440FX-pcihost/pci-bus-pc/pci-bus/virtio-blk-pci/virtio-blk-pci-tests/nxvirtq
==15198==WARNING: ASan doesn't fully support makecontext/swapcontext functions 
and may produce false positives in some cases!
PASS 54 qos-test 
/x86_64/pc/i440FX-pcihost/pci-bus-pc/pci-bus/virtio-blk-pci/virtio-blk-pci-tests/hotplug
==15204==WARNING: ASan doesn't fully support makecontext/swapcontext functions 
and may produce false positives in some cases!
PASS 55 qos-test 
/x86_64/pc/i440FX-pcihost/pci-bus-pc/pci-bus/virtio-blk-pci/virtio-blk/virtio-blk-tests/indirect
==15210==WARNING: ASan doesn't fully support makecontext/swapcontext functions 
and may produce false positives in some cases!
PASS 56 qos-test 
/x86_64/pc/i440FX-pcihost/pci-bus-pc/pci-bus/virtio-blk-pci/virtio-blk/virtio-blk-tests/config
==15216==WARNING: ASan doesn't fully support makecontext/swapcontext functions 
and may produce false positives in some cases!
PASS 57 qos-test 
/x86_64/pc/i440FX-pcihost/pci-bus-pc/pci-bus/virtio-blk-pci/virtio-blk/virtio-blk-tests/basic
==15222==WARNING: ASan doesn't fully support makecontext/swapcontext functions 
and may produce false positives in some cases!
PASS 58 qos-test 
/x86_64/pc/i440FX-pcihost/pci-bus-pc/pci-bus/virtio-blk-pci/virtio-blk/virtio-blk-tests/resize
PASS 59 qos-test 
/x86_64/pc/i440FX-pcihost/pci-bus-pc/pci-bus/virtio-net-pci/virtio-net/virtio-net-tests/basic
PASS 60 qos-test 
/x86_64/pc/i440FX-pcihost/pci-bus-pc/pci-bus/virtio-net-pci/virtio-net/virtio-net-tests/rx_stop_cont
---
PASS 68 qos-test 
/x86_64/pc/i440FX-pcihost/pci-bus-pc/pci-bus/virtio-rng-pci/virtio-rng-pci-tests/hotplug
PASS 69 qos-test 
/x86_64/pc/i440FX-pcihost/pci-bus-pc/pci-bus/virtio-rng-pci/pci-device/pci-device-tests/nop
PASS 70 qos-test 
/x86_64/pc/i440FX-pcihost/pci-bus-pc/pci-bus/virtio-rng-pci/virtio/virtio-tests/nop
==15314==WARNING: ASan doesn't fully support makecontext/swapcontext functions 
and may produce false positives in some cases!
PASS 71 qos-test 
/x86_64/pc/i440FX-pcihost/pci-bus-pc/pci-bus/virtio-scsi-pci/virtio-scsi-pci-tests/iothread-attach-node
==15325==WARNING: ASan doesn't fully support makecontext/swapcontext functions 
and may produce false positives in some cases!
PASS 72 qos-test 
/x86_64/pc/i440FX-pcihost/pci-bus-pc/pci-bus/virtio-scsi-pci/pci-device/pci-device-tests/nop
==15330==WARNING: ASan doesn't fully support makecontext/swapcontext functions 
and may produce false positives in some cases!
PASS 73 qos-test 
/x86_64/pc/i440FX-pcihost/pci-bus-pc/pci-bus/virtio-scsi-pci/virtio-scsi/virtio-scsi-tests/hotplug
==15335==WARNING: ASan doesn't fully support makecontext/swapcontext functions 
and may produce false positives in some cases!
PASS 74 qos-test 
/x86_64/pc/i440FX-pcihost/pci-bus-pc/pci-bus/virtio-scsi-pci/virtio-scsi/virtio-scsi-tests/unaligned-write-same
PASS 75 qos-test 
/x86_64/pc/i440FX-pcihost/pci-bus-pc/pci-bus/virtio-serial-pci/pci-device/pci-device-tests/nop
PASS 76 qos-test 
/x86_64/pc/i440FX-pcihost/pci-bus-pc/pci-bus/virtio-serial-pci/virtio/virtio-tests/nop
---
    raise CalledProcessError(retcode, cmd)
subprocess.CalledProcessError: Command '['sudo', '-n', 'docker', 'run', 
'--label', 'com.qemu.instance.uuid=ee6927470b8b43a0aaffaf7b364a2822', '-u', 
'1001', '--security-opt', 'seccomp=unconfined', '--rm', '-e', 
'TARGET_LIST=x86_64-softmmu', '-e', 'EXTRA_CONFIGURE_OPTS=', '-e', 'V=', '-e', 
'J=14', '-e', 'DEBUG=', '-e', 'SHOW_ENV=', '-e', 'CCACHE_DIR=/var/tmp/ccache', 
'-v', '/home/patchew/.cache/qemu-docker-ccache:/var/tmp/ccache:z', '-v', 
'/var/tmp/patchew-tester-tmp-fgj7rg9z/src/docker-src.2020-03-16-19.48.05.17302:/var/tmp/qemu:z,ro',
 'qemu:fedora', '/var/tmp/qemu/run', 'test-debug']' returned non-zero exit 
status 2.
filter=--filter=label=com.qemu.instance.uuid=ee6927470b8b43a0aaffaf7b364a2822
make[1]: *** [docker-run] Error 1
make[1]: Leaving directory `/var/tmp/patchew-tester-tmp-fgj7rg9z/src'
make: *** [docker-run-test-debug@fedora] Error 2

real    39m31.301s
user    0m8.999s


The full log is available at
http://patchew.org/logs/address@hidden/testing.asan/?type=message.
---
Email generated automatically by Patchew [https://patchew.org/].
Please send your feedback to address@hidden

reply via email to

[Prev in Thread] Current Thread [Next in Thread]