[Top][All Lists]

[Date Prev][Date Next][Thread Prev][Thread Next][Date Index][Thread Index]

[Savannah-hackers] [support #103136] install avrdude on redhat 9

From: anonymous
Subject: [Savannah-hackers] [support #103136] install avrdude on redhat 9
Date: Wed, 16 Jun 2004 13:47:22 -0400
User-agent: Mozilla/5.0 (X11; U; Linux i686; en-US; rv:1.2.1) Gecko/20030225

This mail is an automated notification from the support tracker
 of the project: Savannah Administration.

[support #103136] Full Item Snapshot:

URL: <>
Project: Savannah Administration
Submitted by: 0
On: Wed 06/16/2004 at 17:26

Category:  None
Priority:  5 - Normal
Severity:  1 - None
Resolution:  None
Assigned to:  None
Originator Email:  address@hidden
Status:  Open

Summary:  install avrdude on redhat 9

Original Submission:  Attempting to install avrdude get the following errors 
during make while following instructions in doc.
make[2]: texi2html: Command not found
make[2]: *** [html] Error 127
make[2]: Leaving directory `/home/mg/avrdude-4.3.0/doc'
make[1]: *** [all-recursive] Error 1
make[1]: Leaving directory `/home/mg/avrdude-4.3.0'
make: *** [all] Error 2
any help would be greatly appreciated

For detailed info, follow this link:

  Message sent via/by Savannah

reply via email to

[Prev in Thread] Current Thread [Next in Thread]