users-prolog
[Top][All Lists]
Advanced

[Date Prev][Date Next][Thread Prev][Thread Next][Date Index][Thread Index]

error compiling prolog


From: micheon eubanks
Subject: error compiling prolog
Date: Wed, 04 Feb 2004 00:35:15 +0000

I am receiving the following error when running make from gprolot-1.2.16 on sparc/solaris machive v5.8:

gplc -c utils.wam
as: "/var/tmp/gplcmhqMvc.s", line 1055: error: statement syntax
as: "/var/tmp/gplcmhqMvc.s", line 1075: error: missing '('
as: "/var/tmp/gplcmhqMvc.s", line 1075: error: statement syntax
as: "/var/tmp/gplcmhqMvc.s", line 1095: error: statement syntax
as: "/var/tmp/gplcmhqMvc.s", line 1095: error: statement syntax
as: "/var/tmp/gplcmhqMvc.s", line 1105: error: statement syntax
as: "/var/tmp/gplcmhqMvc.s", line 1105: error: statement syntax
compilation failed
*** Error code 1
make: Fatal error: Command failed for target `utils.o'


Can someone help me with this?

sheon

_________________________________________________________________
High-speed users¬óbe more efficient online with the new MSN Premium Internet Software. http://join.msn.com/?pgmarket=en-us&page=byoa/prem&ST=1





reply via email to

[Prev in Thread] Current Thread [Next in Thread]