[Top][All Lists]

[Date Prev][Date Next][Thread Prev][Thread Next][Date Index][Thread Index]

[GNU Bison 1.875] testsuite: 80 failed

From: Keith Bawden
Subject: [GNU Bison 1.875] testsuite: 80 failed
Date: 16 Mar 2003 10:04:33 +1000

torture.at:374: bison -v -o input.c input.y
torture.at:375: $CC $CFLAGS $CPPFLAGS input.c -o input
gcc: Internal error: Segmentation fault (program cc1)
Please submit a full bug report.
See <URL:http://bugzilla.redhat.com/bugzilla/> for instructions.
torture.at:375: exit code was 1, expected 0
80. torture.at:366: FAILED near `torture.at:375'
## ------------------------- ##
## testsuite.log is created. ##
## ------------------------- ##

Please send `testsuite.log' and all information you think might help:

   To: <address@hidden>
   Subject: [GNU Bison 1.875] testsuite: 80 failed

make[2]: *** [check-local] Error 1
make[2]: Leaving directory `/home/keithb/MISC/bison-1.875/tests'
make[1]: *** [check-am] Error 2
make[1]: Leaving directory `/home/keithb/MISC/bison-1.875/tests'
make: *** [check-recursive] Error 1

Keith Bawden <address@hidden>

Attachment: testsuite.log
Description: Text document

reply via email to

[Prev in Thread] Current Thread [Next in Thread]