[Top][All Lists]

[Date Prev][Date Next][Thread Prev][Thread Next][Date Index][Thread Index]

[Groff] Compilation problem under Mac OS X

From: Robert D. Goulding
Subject: [Groff] Compilation problem under Mac OS X
Date: Sat, 12 Jul 2003 12:37:33 -0400 (EDT)

Trying to build latest CVS snapshot, and get this error:

g++ -I. -I/Users/goulding/groff-1.19/src/devices/grohtml
-I/Users/goulding/groff-1.19/src/include -DHAVE_CONFIG_H -g -O2  -c
post-html.cpp: In method `void html_printer::do_file_components()':
post-html.cpp:3857: non-lvalue in assignment
make[2]: *** [post-html.o] Error 1
make[1]: *** [src/devices/grohtml] Error 2
make: *** [all] Error 2

Mac OS 10.1.5, with one of the older devtools (g++ -v gives:

Apple Computer, Inc. version gcc-937.2, based on gcc version 2.95.2
19991024 (release))


Robert Goulding
Society of Fellows
Joseph Henry House
Princeton NJ 08544

reply via email to

[Prev in Thread] Current Thread [Next in Thread]