[Top][All Lists]

[Date Prev][Date Next][Thread Prev][Thread Next][Date Index][Thread Index]

Re: [avr-gcc-list] Build Failure avr-gcc

From: Andy Warner
Subject: Re: [avr-gcc-list] Build Failure avr-gcc
Date: Tue, 28 Sep 2004 21:41:21 -0500
User-agent: Mutt/1.2.5i

Phillip Mastroianni wrote:
> I am getting the following error when building avg-gcc, what do I need 
> to do and get this thing to build?
> avr-ar  rc ./libgcc.a libgcc/./_mulqi3.o libgcc/./_mulhi3.o 
> [...]
> make[2]: avr-ar: Command not found
> make[2]: *** [libgcc.a] Error 127
> make[2]: Leaving directory `/usr/local/src/compilers/gcc-3.4.0/gcc'
> make[1]: *** [stmp-multilib] Error 2
> make[1]: Leaving directory `/usr/local/src/compilers/gcc-3.4.0/gcc'
> make: *** [all-gcc] Error 2

avr-ar is part of binutils, are you building that first ?
If you are - is it in your $PATH when you are building avr-gcc ?

Andy Warner             Voice: (612) 801-8549   Fax: (208) 575-5634

reply via email to

[Prev in Thread] Current Thread [Next in Thread]