[Top][All Lists]

[Date Prev][Date Next][Thread Prev][Thread Next][Date Index][Thread Index]

[Axiom-developer] build error

From: Eduardo Cavazos
Subject: [Axiom-developer] build error
Date: Thu, 30 Jul 2009 21:59:14 -0500
User-agent: Mozilla/5.0 (X11; U; Linux i686; en-US; rv: Gecko/20080716 SeaMonkey/1.1.11


The build finishes on my system with the following output:

make[4]: Entering directory `/src/axiom/int/input'
0 starting algebra regression testing
make[5]: Entering directory `/src/axiom/int/input'
make[5]: *** No rule to make target `Any.regress', needed by `all'.  Stop.
make[5]: Leaving directory `/src/axiom/int/input'
make[4]: *** [all] Error 2
make[4]: Leaving directory `/src/axiom/int/input'
make[3]: *** [regress] Error 2
make[3]: Leaving directory `/src/axiom/src/input'
make[2]: *** [inputdir] Error 2
make[2]: Leaving directory `/src/axiom/src'
make[1]: *** [srcdir] Error 2
make[1]: Leaving directory `/src/axiom'
make: *** [all] Error 2
/src/axiom #

Any guesses?

I'm on a Linux system with gcc 4.2.2. Let me know if you need more particular information.



reply via email to

[Prev in Thread] Current Thread [Next in Thread]