[Top][All Lists]

[Date Prev][Date Next][Thread Prev][Thread Next][Date Index][Thread Index]

[Gnash-commit] [bug #38573] Gnash 0.8.11dev failed to build with FFmpeg

From: Nachanon Vetjasit
Subject: [Gnash-commit] [bug #38573] Gnash 0.8.11dev failed to build with FFmpeg r11872/libavcodec 51.50.0
Date: Sat, 23 Mar 2013 04:07:36 +0000
User-agent: Opera/9.64 (X11; Linux i686; U; en) Presto/2.1.1

Follow-up Comment #13, bug #38573 (project gnash):

@Alexis Ballier
If both first and second patch were applied, all errors in b482bd62
disappeared. But one new error popped up:

ffmpeg/MediaParserFfmpeg.cpp: In member function 'uint16_t
ffmpeg/MediaParserFfmpeg.cpp:663: error: 'AV_SAMPLE_FMT_S24' was not declared
in this scope
make[2]: *** [libgnashmedia_la-MediaParserFfmpeg.lo] Error 1
make[2]: Leaving directory `/home/window/build/gnashgit/libmedia'
make[1]: *** [all-recursive] Error 1
make[1]: Leaving directory `/home/window/build/gnashgit'
make: *** [all] Error 2


Reply to this item at:


  Message sent via/by Savannah

reply via email to

[Prev in Thread] Current Thread [Next in Thread]