[Top][All Lists]

[Date Prev][Date Next][Thread Prev][Thread Next][Date Index][Thread Index]

Re: [Gnash-dev] Cannot compile CVS

From: Lee Revell
Subject: Re: [Gnash-dev] Cannot compile CVS
Date: Thu, 18 May 2006 15:26:34 -0400

On Thu, 2006-05-18 at 19:08 +0200, strk wrote:
> On Thu, May 18, 2006 at 01:03:34PM -0400, Lee Revell wrote:
> > Any idea what's wrong?
> libgtkglext is a requirement.
> Do you have it ? 

Now I get:

g++ -g -O2 -ansi -Wall -o .libs/gnash gnash.o  -L/usr/lib
-L/usr/X11R6/lib /usr/lib/ /usr/lib/ /usr/lib/ 
/usr/lib/ -lm /usr/lib/ /usr/lib/ 
/usr/lib/ /usr/lib/ 
/usr/lib/ /usr/lib/ /usr/lib/ 
/usr/lib/ /usr/lib/ ./.libs/ 
../server/.libs/ ../server/.libs/ 
../libgeometry/.libs/ ../libbase/.libs/ 
/usr/lib/ -L/usr/share/qt3/lib -lpng -lGLU -lGL -lSM -lICE 
-lXinerama -lXrandr -lXcursor -lXfixes -lXrender -lpng12 -lfontconfig 
-lgssapi_krb5 -lkrb5 -lk5crypto -lkrb5support -lcom_err -lresolv -lssl -lcrypto 
-lz -lrt -lXi -lXmu -laudio -lXt -lXext -lncurses -lslang -lX11 -ldl -lpthread
../server/.libs/ undefined reference to
`gnash::edit_text_character_def::read(gnash::stream*, int,
../server/.libs/ undefined reference to `vtable for
collect2: ld returned 1 exit status
make[2]: *** [gnash] Error 1
make[2]: Leaving directory `/smb/rlrevell/cvs/gnash/gnash/backend'
make[1]: *** [all-recursive] Error 1
make[1]: Leaving directory `/smb/rlrevell/cvs/gnash/gnash'
make: *** [all] Error 2


reply via email to

[Prev in Thread] Current Thread [Next in Thread]