[Top][All Lists]

[Date Prev][Date Next][Thread Prev][Thread Next][Date Index][Thread Index]

Re: Problem with emacs-libgit

From: Zelphir Kaltstahl
Subject: Re: Problem with emacs-libgit
Date: Tue, 17 May 2022 19:49:32 +0000

Thanks for the quick response!

Working around it for now by using an older revision of Guix / older channel.

Best regards,

On 5/17/22 09:29, Zhu Zihao wrote:
You may interest in

And also

Zelphir Kaltstahl <> writes:

Hello Guix developers!

Today I am experiencing a problem with installing Emacs via Guix on foreign 

Here is what I do:

~~~~shell command~~~~
guix time-machine \
      --channels="${DIR}/channels.scm" -- \
      shell \
      --manifest="${DIR}/manifest.scm" -- \

My channels.scm was updated today, using `guix pull && guix package -u` and then 
`guix describe --format=channels > channels.scm`, so I guess it should be very up to 

(list (channel
         (name 'guix)
         (url "";)
         (branch "master")
               "BBB0 2DDF 2CEA F6A8 0D1D  E643 A2A0 6DF2 A33A 54FA")))))

    ;; "emacs-python-environment"
    ;; "emacs-typescript-mode"

My manifest seems long, but the actual error that happens is the following:

substitute: updating substitutes from ''... 100.0%
substitute: updating substitutes from ''... 100.0%
The following derivations will be built:

| 'check' phasebuilder for 
 failed with exit code 1
build of 
View build log at 
guix shell: error: build of 

And that log file contains the following at the end (it is over 400 lines):

29/29 Test #29: libegit2_tree ....................   Passed    0.09 sec

97% tests passed, 1 tests failed out of 29

Total Test time (real) =   7.87 sec

The following tests FAILED:
           3 - libegit2_blob (Failed)
Errors while running CTest
make: *** [Makefile:94: test] Error 8

Test suite failed, dumping logs.
error: in phase 'check': uncaught exception:
%exception #<&invoke-error program: "make" arguments: ("test" "-j" "16") 
exit-status: 2 term-signal: #f stop-signal: #f>
phase `check' failed after 7.9 seconds
command "make" "test" "-j" "16" failed with status 2

So it seems some test is failing and that prevents the whole build.

Is there anything else, that I should be providing as info? I attach the whole 
log file to this message.

Best regards,


reply via email to

[Prev in Thread] Current Thread [Next in Thread]