[Top][All Lists]

[Date Prev][Date Next][Thread Prev][Thread Next][Date Index][Thread Index]

error with make test-base-line

From: Thomas Morley
Subject: error with make test-base-line
Date: Sun, 15 Jul 2012 11:49:04 +0200


I tried to investigate why patchy complains about my patch: Issue
6397043: parenthesizeStencil and bracketifyStencil

I decided to start from scratch i.e
`Amend previous commit' and `Abort changes -- Reset to origin'
Then `Update source' and new compiling, running `make' in /lilypond-git/build.

Then I wanted to continue with regtest comparison as described in CG 9.4
But `make test-baseline' resulted in an error:
The log ends:

Please check the logfile collated-files.texilog.log for errors

make[3]: *** [out-test/collated-files.html] Error 2
make[3]: Leaving directory `/home/harm/lilypond-git/build/input/regression'
make[2]: *** [local-test] Error 2
make[2]: Leaving directory `/home/harm/lilypond-git/build/input/regression'
make[1]: *** [test] Error 2
make[1]: Leaving directory `/home/harm/lilypond-git/build'
make: *** [test-baseline-create] Error 2
address@hidden ~/lilypond-git/build (dev/local_working)$

The file

*** Can't find parenthesize-markup.texidoc, skipping (l. 26421)
Max error number exceeded

I had done `make test-baseline' before without a problem, but now it
does not work.
What's wrong and what should I do?


reply via email to

[Prev in Thread] Current Thread [Next in Thread]