[Top][All Lists]

[Date Prev][Date Next][Thread Prev][Thread Next][Date Index][Thread Index]

make test-baseline fails

From: Thomas Morley
Subject: make test-baseline fails
Date: Fri, 6 Dec 2019 14:38:12 +0100


I just tried `make test-baseline┬┤ form current master:

It fails with:

Making input/regression/lilypond-book/out-test/suffix-latex.pdf < tex
Error: /invalidfileaccess in --file--
Operand stack:
   (/home/hermann/.local/share/fonts/C059-Bold.otf)   (r)
Execution stack:
   %interp_exit   .runexec2   --nostringval--   --nostringval--
--nostringval--   2   %stopped_push   --nostringval--
--nostringval--   --nostringval--   false   1   %stopped_push   1974
1   3   %oparray_pop   1973   1   3   %oparray_pop   1961   1   3
%oparray_pop   1817   1   3   %oparray_pop   --nostringval--
%errorexec_pop   .runexec2   --nostringval--   --nostringval--
--nostringval--   2   %stopped_push   --nostringval--
Dictionary stack:
   --dict:732/1123(ro)(G)--   --dict:0/20(G)--   --dict:76/200(L)--
Current allocation mode is local
Last OS error: Permission denied
Current file position is 238
GPL Ghostscript GIT PRERELEASE 9.51: Unrecoverable error, exit code 1
recipe for target 'out-test/suffix-latex.pdf' failed
make[3]: *** [out-test/suffix-latex.pdf] Error 1
make[3]: *** Deleting file 'out-test/suffix-latex.pdf'
recipe for target 'local-test' failed
make[2]: *** [local-test] Error 2
/home/hermann/lilypond-git-guile-2.2/ recipe for
target 'test' failed
make[1]: *** [test] Error 2
/home/hermann/lilypond-git-guile-2.2/ recipe for
target 'test-baseline-pre' failed
make: *** [test-baseline-pre] Error 2

I use selfcompiled ghostscript 9.51 and guile-1.8.8 (don't get
confused by the repo-name)

Any insights?


reply via email to

[Prev in Thread] Current Thread [Next in Thread]