[Top][All Lists]

[Date Prev][Date Next][Thread Prev][Thread Next][Date Index][Thread Index]

[Paparazzi-devel] error while buiding code for quad lisa/m

From: evan igor
Subject: [Paparazzi-devel] error while buiding code for quad lisa/m
Date: Sun, 8 Sep 2013 15:44:13 +0300

Hi everyone,

 i found this error while building the code could anyone give recommendation

Using CC   = /opt/paparazzi/arm-multilib/bin/arm-none-eabi-gcc
Using LD   = /opt/paparazzi/arm-multilib/bin/arm-none-eabi-gcc
Using CP   = /opt/paparazzi/arm-multilib/bin/arm-none-eabi-objcopy
Using DMP  = /opt/paparazzi/arm-multilib/bin/arm-none-eabi-objdump
Using NM   = /opt/paparazzi/arm-multilib/bin/arm-none-eabi-nm
Using SIZE = /opt/paparazzi/arm-multilib/bin/arm-none-eabi-size
GCC version:
arm-none-eabi-gcc (Linaro GCC 4.6-2011.09-1) 4.6.2 20110908 (prerelease)

CC /home/mavel/paparazzi/var/Quad_LisaM_2/ap/mcu.o
In file included from mcu_periph/sys_time.h:192:0,
                 from mcu.c:32:
/home/mavel/paparazzi/sw/airborne/arch/stm32/mcu_periph/sys_time_arch.h:39:36: fatal error: libopencm3/cm3/systick.h: No such file or directory
compilation terminated.
make[1]: *** [/home/mavel/paparazzi/var/Quad_LisaM_2/ap/mcu.o] Error 1
make[1]: Leaving directory `/home/mavel/paparazzi/sw/airborne'
make: *** [ap.compile] Error 2
make: Leaving directory `/home/mavel/paparazzi'

FAILED 'make -C /home/mavel/paparazzi -f AIRCRAFT=Quad_LisaM_2 ap.compile' with code 2

reply via email to

[Prev in Thread] Current Thread [Next in Thread]