[Top][All Lists]

[Date Prev][Date Next][Thread Prev][Thread Next][Date Index][Thread Index]

[platform-testers] Fwd: coreutils installation error

From: Billa Surendra
Subject: [platform-testers] Fwd: coreutils installation error
Date: Thu, 13 Jan 2022 17:11:53 +0530

---------- Forwarded message ---------
From: Billa Surendra <>
Date: Thu, Jan 13, 2022 at 5:05 PM
Subject: coreutils installation error
To: <>

Dear All,

I am trying to install coreutils-9.0 version on my RISC-V Linux machine but it's giving an error. Can anyone please help me to solve this particular error?.

help2man: can't get `--help' info from man/
Try `--no-discard-stderr' if option outputs to stderr
make[2]: *** [Makefile:18446: man/cp.1] Error 127
make[2]: *** Waiting for unfinished jobs....
make[2]: Leaving directory '/home/package_building/coreutils-9.0'
make[1]: *** [Makefile:13461: all-recursive] Error 1
make[1]: Leaving directory '/home/package_building/coreutils-9.0'
make: *** [Makefile:7383: all] Error 2


reply via email to

[Prev in Thread] Current Thread [Next in Thread]