[Top][All Lists]

[Date Prev][Date Next][Thread Prev][Thread Next][Date Index][Thread Index]

Re: [platform-testers] Fwd: coreutils installation error

From: Efraim Flashner
Subject: Re: [platform-testers] Fwd: coreutils installation error
Date: Thu, 13 Jan 2022 18:45:26 +0000
User-agent: K-9 Mail for Android

Error 127 is missing command. What is it trying to call on line 18446 of the Makefile?

On January 13, 2022 11:41:53 AM UTC, Billa Surendra <> wrote:

---------- Forwarded message ---------
From: Billa Surendra <>
Date: Thu, Jan 13, 2022 at 5:05 PM
Subject: coreutils installation error
To: <>

Dear All,

I am trying to install coreutils-9.0 version on my RISC-V Linux machine but it's giving an error. Can anyone please help me to solve this particular error?.

help2man: can't get `--help' info from man/
Try `--no-discard-stderr' if option outputs to stderr
make[2]: *** [Makefile:18446: man/cp.1] Error 127
make[2]: *** Waiting for unfinished jobs....
make[2]: Leaving directory '/home/package_building/coreutils-9.0'
make[1]: *** [Makefile:13461: all-recursive] Error 1
make[1]: Leaving directory '/home/package_building/coreutils-9.0'
make: *** [Makefile:7383: all] Error 2


Sent from my Android device with K-9 Mail. Please excuse my brevity.

reply via email to

[Prev in Thread] Current Thread [Next in Thread]