[Top][All Lists]

[Date Prev][Date Next][Thread Prev][Thread Next][Date Index][Thread Index]

Re: Compile GNUstep-base failed

From: Adam Fedor
Subject: Re: Compile GNUstep-base failed
Date: Tue, 07 May 2002 16:18:17 -0600
User-agent: Mozilla/5.0 (X11; U; Linux ppc; en-US; rv:0.9.8) Gecko/20020310

Yen-Ju Chen wrote:
>   It stoped at NSBundle.
> In file included from NSBundle.m:35:
> ../Headers/Foundation/objc-load.h:15:16: #if with no expression
> gmake[2]: *** [shared_obj/ix86/freebsd/gnu-gnu-gnu/NSBundle.o] Error 1
> gmake[1]: *** [libgnustep-base.all.library.variables] Error 2
> gmake[1]: Leaving directory `/root/gnustep/core/base/Source'
> gmake: *** [internal-all] Error 2

I fixed configure so this should work now. Reconfigure gnustep-base
after a CVS update.

>   I attached my output of ./configure and gmake, and the config.log
>   There is another warning which I never met before when ./configure:
>   configure: WARNING: sys/mount.h: present but cannot be compiled
>   configure: WARNING: sys/mount.h: check for missing prerequisite headers?
>   configure: WARNING: sys/mount.h: proceeding with the preprocessor's result
>   Have no idea whethere they are related.

You can ignore that.

Adam Fedor, Digital Optics Corp.      | I'm glad I hate spinach, because
http://www.doc.com                    | if I didn't, I'd eat it, and you
                                      | know how I hate the stuff.

reply via email to

[Prev in Thread] Current Thread [Next in Thread]