discuss-gnustep
[Top][All Lists]
Advanced

[Date Prev][Date Next][Thread Prev][Thread Next][Date Index][Thread Index]

Compiling gnustep-base-1.5.0 with OpenBSD3.1


From: Ingo Brombach
Subject: Compiling gnustep-base-1.5.0 with OpenBSD3.1
Date: 19 Sep 2002 11:34:09 +0200
User-agent: Gnus/5.09 (Gnus v5.9.0) Emacs/21.1

Hello there,

I would like to try out Programming with Objective-C. I`m a OpenBSD User so I 
try to get the necessary things running with this OS.
Following the HOWTO (except the version numbers) everything went fine, but 
while trying to get gnu-base (1.5.0) compiled under OpenBSD3.1 the following 
occurs:

source /opt/GNUstep/System/Makefiles/GNUstep.csh
./configure
gmake
(cd Source/Additions/static_obj/ix86/openbsd3.1/gnu-gnu-gnu;
        ar -vr subproject.o GSMime.o;ar -vr subproject.o GSXML.o\
)
gmake

The additional ar - run was a hint from Marek Behr who encountered similar 
problems with  SGI IRIX 6.5. 
then I get those error messages at the end of this message.

Marek Behr stated, that the next thing to do is "repeat that command line(s) 
adding the above subproject.o to the mix."
But how can I do this. Unfortunately I don`t know where - or in which kind of 
makefile - to look for this command line.

Thanks in advance for any hint !

...
 Linking tool autogsdoc ...
static_obj/ix86/openbsd3.1/gnu-gnu-gnu/autogsdoc.o: Undefined symbol 
`___objc_class_name_GSXMLParser' referenced from text segment
static_obj/ix86/openbsd3.1/gnu-gnu-gnu/AGSIndex.o: Undefined symbol 
`___objc_class_name_GSXMLNode' referenced from text segment
static_obj/ix86/openbsd3.1/gnu-gnu-gnu/AGSHtml.o: Undefined symbol 
`___objc_class_name_GSXMLNode' referenced from text segment
NSString.o: Undefined symbol `___objc_class_name_GSXMLNode' referenced from 
text segment
NSString.o: Undefined symbol `___objc_class_name_GSXMLParser' referenced from 
text segment
thr-posix.o: Undefined symbol `_pthread_key_create' referenced from text segment
thr-posix.o: Undefined symbol `_pthread_attr_init' referenced from text segment
thr-posix.o: Undefined symbol `_pthread_attr_setdetachstate' referenced from 
text segment
thr-posix.o: Undefined symbol `_pthread_key_delete' referenced from text segment
thr-posix.o: Undefined symbol `_pthread_attr_destroy' referenced from text 
segment
thr-posix.o: Undefined symbol `_pthread_create' referenced from text segment
thr-posix.o: Undefined symbol `_pthread_self' referenced from text segment
thr-posix.o: Undefined symbol `_pthread_getschedparam' referenced from text 
segment
thr-posix.o: Undefined symbol `_sched_get_priority_max' referenced from text 
segment
thr-posix.o: Undefined symbol `_sched_get_priority_min' referenced from text 
segment
thr-posix.o: Undefined symbol `_pthread_setschedparam' referenced from text 
segment
thr-posix.o: Undefined symbol `_pthread_self' referenced from text segment
thr-posix.o: Undefined symbol `_pthread_getschedparam' referenced from text 
segment
thr-posix.o: Undefined symbol `_sched_yield' referenced from text segment
thr-posix.o: Undefined symbol `_pthread_exit' referenced from text segment
thr-posix.o: Undefined symbol `_pthread_self' referenced from text segment
thr-posix.o: Undefined symbol `_pthread_setspecific' referenced from text 
segment
thr-posix.o: Undefined symbol `_pthread_getspecific' referenced from text 
segment
thr-posix.o: Undefined symbol `_pthread_mutex_init' referenced from text segment
thr-posix.o: Undefined symbol `_pthread_mutex_unlock' referenced from text 
segment
thr-posix.o: Undefined symbol `_pthread_mutex_destroy' referenced from text 
segment
thr-posix.o: Undefined symbol `_pthread_mutex_lock' referenced from text segment
thr-posix.o: Undefined symbol `_pthread_mutex_trylock' referenced from text 
segment
thr-posix.o: Undefined symbol `_pthread_mutex_unlock' referenced from text 
segment
thr-posix.o: Undefined symbol `_pthread_cond_init' referenced from text segment
thr-posix.o: Undefined symbol `_pthread_cond_destroy' referenced from text 
segment
thr-posix.o: Undefined symbol `_pthread_cond_wait' referenced from text segment
thr-posix.o: Undefined symbol `_pthread_cond_broadcast' referenced from text 
segment
thr-posix.o: Undefined symbol `_pthread_cond_signal' referenced from text 
segment
collect2: ld returned 1 exit status
gmake[2]: *** [static_obj/ix86/openbsd3.1/gnu-gnu-gnu/autogsdoc] Error 1
gmake[1]: *** [autogsdoc.all.tool.variables] Error 2
gmake[1]: Leaving directory `/export/src/devel/gnustep-base-1.5.0/Tools'
gmake: *** [internal-all] Error 2


-- 
Ingo Brombach <address@hidden>
Tel: +49202-307 569
Fax: +49202-370 2723




reply via email to

[Prev in Thread] Current Thread [Next in Thread]