discuss-gnustep
[Top][All Lists]
Advanced

[Date Prev][Date Next][Thread Prev][Thread Next][Date Index][Thread Index]

Error compiling Gnustep


From: Pavel West
Subject: Error compiling Gnustep
Date: Sat, 28 Sep 2002 22:31:08 +0200
User-agent: Mozilla/5.0 (X11; U; Linux i686; en-US; rv:1.2a) Gecko/20020910

Hello,

I tried to compile Gnustep on my Linux ( Suse 8.0 ) box but I got this message. It happend when I tried to compile gnustep-gui-0.8.1. I have installed gcc 3.2 on my system.
Can anybody help ?

here is an error message
---------------------------------------

 Compiling file example.m ...
example.m: In function `init':
example.m:199: warning: passing arg 2 of `signal' from incompatible pointer type example.m:207: warning: passing arg 2 of `signal' from incompatible pointer type
 Linking service example ...
/usr/GNUstep/System/Makefiles/mkinstalldirs example.service/Resources
mkdir -p example.service/Resources

GNUSTEP Internal Error:
The private GNUstep function to establish the argv and environment
variables was not called.
Please report the error to address@hidden

: Uncaught exception NSInternalInconsistencyException, reason:
GNUSTEP Internal Error:
The private GNUstep function to establish the argv and environment
variables was not called.
Please report the error to address@hidden


make[2]: *** [example.service/Resources/Info-gnustep.plist] Error 1
make[1]: *** [example.all.service.variables] Error 2
make[1]: Leaving directory `/tmp/gnustep-new/gnustep-gui-0.8.1/Tools'
make: *** [internal-all] Error 2
gandalf:/tmp/gnustep-new/gnustep-gui-0.8.1 #
gandalf:/tmp/gnustep-new/gnustep-gui-0.8.1 #


Regards


Pavel





reply via email to

[Prev in Thread] Current Thread [Next in Thread]