[Top][All Lists]

[Date Prev][Date Next][Thread Prev][Thread Next][Date Index][Thread Index]

cannot build on w32

From: Sam Steingold
Subject: cannot build on w32
Date: Wed, 19 Jan 2011 10:12:21 -0500

this morning bzr pull.

$ ./configure.bat --no-debug --with-gcc --cflags
-IC:/gnu/gnuwin32/include --ldflags -LC:/gnu/gnuwin32/lib
$ make bootstrap
gcc -I. -c  -mno-cygwin -mtune=pentium4 -O2
-IC:/gnu/gnuwin32/include -Demacs=1 -DHAVE_CONFIG_H -I../nt/inc
oo-spd/i386/w32.o w32.c
w32.c: In function `check_windows_init_file':
w32.c:5659: error: conflicting types for 'globals'
globals.h:1700: error: previous declaration of 'globals' was here
w32.c:5659: error: parse error before '.' token
w32.c:5665: error: request for member `f_Vload_path' in something not
a structure or union
make[2]: *** [oo-spd/i386/w32.o] Error 1

Sam Steingold <http://sds.podval.org>

reply via email to

[Prev in Thread] Current Thread [Next in Thread]