[Top][All Lists]

[Date Prev][Date Next][Thread Prev][Thread Next][Date Index][Thread Index]

CVS 2.1 web build fails

From: Graham Percival
Subject: CVS 2.1 web build fails
Date: Fri, 03 Oct 2003 22:55:09 -0700

Recent devel CVS on Debian/testing.  Debian/testing's gv is broken, so I'm
willing to believe that testing's gs is also broken and thus this isn't 
fault at all.  Here's the build process:
make distclean
make all
% no problem
make web
Reading `../../input/regression/'
Reading `../../input/test/'
Reading `../../input/regression/'
Reading `../../input/test/'
Reading `/home/gperciva/dev/lilypond/mf/out/'
Reading `/home/gperciva/dev/lilypond/mf/out/'
Invoking `gs -sDEVICE=bbox -q -dNOPAUSE lily-1292174260.eps -c quit 
2>lily-1292174260.eps.bbox'Error: /rangecheck in --setdash--
Operand stack:
   8.8133   0.6666   0.1   --nostringval--   0
Execution stack:
   %interp_exit   .runexec2   --nostringval--   --nostringval--   
--nostringval--   2   %stopped_push   --nostringval--   --nostringval--   
--nostringval--   false   1   %stopped_push   1   3   %oparray_pop   1   3   
%oparray_pop   --nostringval--   1   3   %oparray_pop   1   3   %oparray_pop   
.runexec2   --nostringval--   --nostringval--   --nostringval--   2   
%stopped_push   --nostringval--   --nostringval--   5   5   %oparray_pop   
--nostringval--   --nostringval--
Dictionary stack:
   --dict:1070/1123(ro)(G)--   --dict:0/20(G)--   --dict:94/200(L)--   
--dict:113/300(L)--   --dict:40/200(L)--
Current allocation mode is local
Last OS error: 2
Current file position is 18091
lilypond-book: error: `gs' failed (status 1)
Traceback (most recent call last):
  File "/home/gperciva/dev/lilypond/scripts/", line 1647, in ?
    do_file (input_filename)
  File "/home/gperciva/dev/lilypond/scripts/", line 1520, in 
    compile_all_files (chunks)
  File "/home/gperciva/dev/lilypond/scripts/", line 1415, in 
    map (ly.make_ps_images, map (lambda x: x + '.eps', png))
  File "/home/gperciva/dev/lilypond/share/lilypond/python/", line 
460, in make_ps_images
    bbox = get_bbox (ps_name)
  File "/home/gperciva/dev/lilypond/share/lilypond/python/", line 
438, in get_bbox
    system (cmd, progress_p = 1)
  File "/home/gperciva/dev/lilypond/share/lilypond/python/", line 
332, in system
    exit (status)
  File "/home/gperciva/dev/lilypond/share/lilypond/python/", line 
130, in exit
    raise _ ('Exiting (%d)...') % i
Exiting (256)...
make[3]: *** [out-www/lilypond.texi] Error 1
make[3]: Leaving directory `/home/gperciva/dev/lilypond/Documentation/user'
make[2]: *** [WWW] Error 2
make[2]: Leaving directory `/home/gperciva/dev/lilypond/Documentation'
make[1]: *** [WWW] Error 2
make[1]: Leaving directory `/home/gperciva/dev/lilypond'
make: *** [web] Error 2

- Graham

reply via email to

[Prev in Thread] Current Thread [Next in Thread]