[Top][All Lists]

[Date Prev][Date Next][Thread Prev][Thread Next][Date Index][Thread Index]

[Octave-bug-tracker] [bug #41067] "run-octave --force-gui" octave exited

From: Mike Sander
Subject: [Octave-bug-tracker] [bug #41067] "run-octave --force-gui" octave exited with signal 11
Date: Sat, 11 Jan 2014 04:24:14 +0000
User-agent: Mozilla/5.0 (X11; Ubuntu; Linux i686; rv:26.0) Gecko/20100101 Firefox/26.0

Follow-up Comment #12, bug #41067 (project octave):

Thanks for suggestion regarding configure flags. wiill use those if/when i get
this built.

i have a clean install of 12.04 running in virtualbox.  got thru bootstrap &
configure stage.   I will submit patch to etc/HACKING for missing

getting an error running make.  i have tried a few times... always fails at
the same point.  seems to be a bash issue (after a bit of googling).  any
ideas?     i pulled from the dev branch a few hours ago.  are build failures
on dev branch expected?

/bin/bash ../libtool  --tag=CXX   --mode=link g++ -mieee-fp -Wall -W -Wshadow
-Wold-style-cast -Wformat -Wpointer-arith -Wwrite-strings -Wcast-align
-Wcast-qual -g -O2 -pthread -avoid-version -module -no-undefined           -o
dldfcn/symbfact.la -rpath /usr/local/lib/octave/4.1.0+
dldfcn/dldfcn_symbfact_la-symbfact.lo liboctinterp.la
../liboctave/liboctave.la         -lutil -lm  

malloc: ../bash/subst.c:8580: assertion botched
free: called with unallocated block argument
Aborting...make[3]: *** [dldfcn/symbfact.la] Aborted (core dumped)
make[3]: Leaving directory `/home/mike/Documents/octave/.build/libinterp'
make[2]: *** [all] Error 2
make[2]: Leaving directory `/home/mike/Documents/octave/.build/libinterp'
make[1]: *** [all-recursive] Error 1
make[1]: Leaving directory `/home/mike/Documents/octave/.build'
make: *** [all] Error 2


Reply to this item at:


  Message sent via/by Savannah

reply via email to

[Prev in Thread] Current Thread [Next in Thread]