[Top][All Lists]

[Date Prev][Date Next][Thread Prev][Thread Next][Date Index][Thread Index]

Re: problems building - faiiling due to autogsdoc

From: Adam Fedor
Subject: Re: problems building - faiiling due to autogsdoc
Date: Thu, 19 Jun 2003 10:43:05 -0600

On Thursday, June 19, 2003, at 10:00 AM, Pete French wrote:

Just did a CVS update, the first for a few days, and now allmy
builds fail lkike this:

cp ../Documentation/Base.gsdoc .
cp ../Documentation/BaseAdditions.gsdoc .
Making all for doc Base...
../Tools/obj/autogsdoc -Project Base -DocumentationDirectory Base -DocumentationDirectory ../Documentation/Base -HeaderDirectory ../Headers/Foundation -Declared Foundation -Standards YES -ConstantsTemplate TypesAndConstants -FunctionsTemplate Functions -MacrosTemplate Functions -TypedefsTemplate TypesAndConstants -VariablesTemplate TypesAndConstants -WordMap '{ FOUNDATION_EXPORT=extern;FOUNDATION_STATIC_INLINE=""; GS_STATIC_INLINE=""; GS_GEOM_SCOPE=extern;GS_GEOM_ATTR=""; GS_EXPORT=extern;GS_DECLARE=""; GS_RANGE_SCOPE=extern;GS_RANGE_ATTR=""; GS_ZONE_SCOPE=extern;GS_ZONE_ATTR=""; INLINE=inline; }' -Up Base ../Documentation/Base.gsdoc ../Documentation/OpenStepCompliance.gsdoc NSArchiver.h NSArray.h NSAttributedString.h NSAutoreleasePool.h NSBitmapCharSet.h NSBundle.h NSCalendarDate.h NSCharacterSet.h NSClassDescription.h NSCoder.h NSConnection.h NSData.h NSDate.h NSDateFormatter.h NSDebug.h NSDecimal.h NSDecimalNumber.h NSDictionary.h NSDistantObject.h NSDistributedLock.h NSDistributedNotificationCenter.h NSEnumerator.h NSException.h NSFileHandle.h NSFileManager.h NSFormatter.h NSGeometry.h NSHashTable.h NSHost.h NSInvocation.h NSKeyValueCoding.h NSLock.h NSMapTable.h NSMethodSignature.h NSNotification.h NSNotificationQueue.h NSNull.h NSNumberFormatter.h NSObjCRuntime.h NSObject.h NSPathUtilities.h NSPort.h NSPortCoder.h NSPortMessage.h NSPortNameServer.h NSProcessInfo.h NSProtocolChecker.h NSProxy.h NSRange.h NSRunLoop.h NSScanner.h NSSet.h NSString.h NSTask.h NSThread.h NSTimeZone.h NSTimer.h NSURL.h NSURLHandle.h NSUndoManager.h NSUserDefaults.h NSValue.h NSZone.h 2003-06-19 16:58:43.474 autogsdoc[14423] No filename arguments found ... giving up
gmake[3]: *** [generate-autogsdoc] Error 1
gmake[2]: *** [Base.all.doc.variables] Error 2
gmake[2]: Leaving directory `/home/pfrench/gnustep/core/base/Source'
gmake[1]: *** [after-all] Error 2
gmake[1]: Leaving directory `/home/pfrench/gnustep/core/base/Documentation'
gmake: *** [internal-all] Error 2

I just added automatic building of the Documentation, so I guess I should have expected problems...

Perhaps your shell or OS can't handle the long argument line. Try to copy and paste this command, except only include one .h file and then run the command (in the Documentation subdirectory).

reply via email to

[Prev in Thread] Current Thread [Next in Thread]