[Top][All Lists]

[Date Prev][Date Next][Thread Prev][Thread Next][Date Index][Thread Index]

[Discuss-gnuradio] Error during "make" gr-usrp

From: Elaine Garbarine
Subject: [Discuss-gnuradio] Error during "make" gr-usrp
Date: Sun, 01 Jan 2006 10:44:21 -0500
User-agent: Microsoft-Entourage/

Hello all,

I'm having a problem when I attempt a make on the gr-usrp module.  I get the
following errors:

/opt/local/bin/swig -c++ -fvirtual -python -modern
-I/usr/local/include/gnuradio/swig -I/usr/local/include/gnuradio
-I/usr/local/include -I/usr/local/include -module usrp0 -o usrp0.cc usrp0.i
usrp0.i:26: Error: Unable to find 'gnuradio.i'
make[2]: *** [usrp0.cc] Error 1
make[1]: *** [all-recursive] Error 1
make: *** [all] Error 2

Can anyone suggest a course of action to fix this?

Elaine G.

reply via email to

[Prev in Thread] Current Thread [Next in Thread]